plugins { id 'java' id 'org.springframework.boot' version '3.5.5' id 'io.spring.dependency-management' version '1.1.7' } 안녕하세요 테스트 코드 진행중 가짜객체를 선언하기 위해 @mock를 사용하려는데 자바17과의 충돌?로 계속해서 에러가 발생하는 상황입니다..! 자바 버전 17에서 21로 변경, mockito 5.xx 최신 버전으로 변경해도 같은 에러에서 벗어나지못했습니다.. 밑에는 전체 에러입니다. ByteBuddy 버전도 올려서 빌드의존성 추가해봤는데도 안되네요 > Task :compileJava UP-TO-DATE > Task :processResources UP-TO-DATE > Task :classes UP-TO-DATE > Task :compileTestJava > Task :processTestResources NO-SOURCE > Task :testClasses java.lang.IllegalStateException: Could not initialize plugin: interface org.mockito.plugins.MockMaker (alternate: null) at org.mockito.internal.configuration.plugins.PluginLoader$1.invoke(PluginLoader.java:85) at jdk.proxy3/jdk.proxy3.$Proxy16.isTypeMockable(Unknown Source) at org.mockito.internal.util.MockUtil.typeMockabilityOf(MockUtil.java:78) at org.mockito.internal.util.MockCreationValidator.validateType(MockCreationValidator.java:22) at org.mockito.internal.creation.MockSettingsImpl.validatedSettings(MockSettingsImpl.java:275) at org.mockito.internal.creation.MockSettingsImpl.build (MockSettingsImpl.java:236) at org.mockito.internal.MockitoCore.mock(MockitoCore.java:82) at org.mockito.Mockito.mock(Mockito.java:2198) at org.mockito.internal.configuration.MockAnnotationProcessor.processAnnotationForMock(MockAnnotationProcessor.java:79) at org.mockito.internal.configuration.MockAnnotationProcessor.process(MockAnnotationProcessor.java:28) at org.mockito.internal.configuration.MockAnnotationProcessor.process(MockAnnotationProcessor.java:25) at org.mockito.internal.configuration.IndependentAnnotationEngine.createMockFor(IndependentAnnotationEngine.java:44) at org.mockito.internal.configuration.IndependentAnnotationEngine.process(IndependentAnnotationEngine.java:72) at org.mockito.internal.configuration.InjectingAnnotationEngine.processIndependentAnnotations(InjectingAnnotationEngine.java:62) at org.mockito.internal.configuration.InjectingAnnotationEngine.process(InjectingAnnotationEngine.java:47) at org.mockito.MockitoAnnotations.openMocks(MockitoAnnotations.java:81) at org.mockito.internal.framework.DefaultMockitoSession.<init>(DefaultMockitoSession.java:43) at org.mockito.internal.session.DefaultMockitoSessionBuilder.startMocking(DefaultMockitoSessionBuilder.java:83) at org.mockito.junit.jupiter.MockitoExtension.beforeEach(MockitoExtension.java:160) at java.base/java.util.ArrayList.forEach(ArrayList.java:1511) at java.base/java.util.ArrayList.forEach(ArrayList.java:1511) Caused by: java.lang.IllegalStateException: Internal problem occurred, please report it. Mockito is unable to load the default implementation of class that is a part of Mockito distribution. Failed to load interface org.mockito.plugins.MockMaker at org.mockito.internal.configuration.plugins.DefaultMockitoPlugins.create(DefaultMockitoPlugins.java:105) at org.mockito.internal.configuration.plugins.DefaultMockitoPlugins.getDefaultPlugin(DefaultMockitoPlugins.java:79) at org.mockito.internal.configuration.plugins.PluginLoader.loadPlugin(PluginLoader.java:75) at org.mockito.internal.configuration.plugins.PluginLoader.loadPlugin(PluginLoader.java:49) at org.mockito.internal.configuration.plugins.PluginRegistry.<init>(PluginRegistry.java:29) at org.mockito.internal.configuration.plugins.Plugins.<clinit>(Plugins.java:26) at org.mockito.internal.MockitoCore.<clinit>(MockitoCore.java:71) at org.mockito.Mockito.<clinit>(Mockito.java:1777) at org.mockito.junit.jupiter.MockitoExtension.beforeEach(MockitoExtension.java:156) ... 2 more Caused by: java.lang.reflect.InvocationTargetException at java.base/java.lang.reflect.Constructor.newInstanceWithCaller(Constructor.java:499) at java.base/java.lang.reflect.Constructor.newInstance(Constructor.java:480) at org.mockito.internal.configuration.plugins.DefaultMockitoPlugins.create(DefaultMockitoPlugins.java:103) ... 10 more Caused by: org.mockito.exceptions.base.MockitoInitializationException: Could not initialize inline Byte Buddy mock maker. It appears as if your JDK does not supply a working agent attachment mechanism. Java : 17 JVM vendor name : Oracle Corporation JVM vendor version : 17.0.10+11-LTS-240 JVM name : Java HotSpot(TM) 64-Bit Server VM JVM version : 17.0.10+11-LTS-240 JVM info : mixed mode, sharing OS name : Windows 10 OS version : 10.0 at org.mockito.internal.creation.bytebuddy.InlineDelegateByteBuddyMockMaker.<init>(InlineDelegateByteBuddyMockMaker.java:275) at org.mockito.internal.creation.bytebuddy.InlineByteBuddyMockMaker.<init>(InlineByteBuddyMockMaker.java:23) ... 13 more Caused by: java.lang.IllegalArgumentException at java.instrument/sun.instrument.InstrumentationImpl.appendToClassLoaderSearch0(Native Method) at java.instrument/sun.instrument.InstrumentationImpl.appendToBootstrapClassLoaderSearch(InstrumentationImpl.java:220) at org.mockito.internal.creation.bytebuddy.InlineDelegateByteBuddyMockMaker.<clinit>(InlineDelegateByteBuddyMockMaker.java:175) ... 14 more Internal problem occurred, please report it. Mockito is unable to load the default implementation of class that is a part of Mockito distribution. Failed to load interface org.mockito.plugins.MockMaker java.lang.IllegalStateException: Internal problem occurred, please report it. Mockito is unable to load the default implementation of class that is a part of Mockito distribution. Failed to load interface org.mockito.plugins.MockMaker at org.mockito.internal.configuration.plugins.DefaultMockitoPlugins.create(DefaultMockitoPlugins.java:105) at org.mockito.internal.configuration.plugins.DefaultMockitoPlugins.getDefaultPlugin(DefaultMockitoPlugins.java:79) at org.mockito.internal.configuration.plugins.PluginLoader.loadPlugin(PluginLoader.java:75) at org.mockito.internal.configuration.plugins.PluginLoader.loadPlugin(PluginLoader.java:49) at org.mockito.internal.configuration.plugins.PluginRegistry.<init>(PluginRegistry.java:29) at org.mockito.internal.configuration.plugins.Plugins.<clinit>(Plugins.java:26) at org.mockito.internal.MockitoCore.<clinit>(MockitoCore.java:71) at org.mockito.Mockito.<clinit>(Mockito.java:1777) at org.mockito.junit.jupiter.MockitoExtension.beforeEach(MockitoExtension.java:156) at java.base/java.util.ArrayList.forEach(ArrayList.java:1511) at java.base/java.util.ArrayList.forEach(ArrayList.java:1511) Caused by: java.lang.reflect.InvocationTargetException at java.base/java.lang.reflect.Constructor.newInstanceWithCaller(Constructor.java:499) at java.base/java.lang.reflect.Constructor.newInstance(Constructor.java:480) at org.mockito.internal.configuration.plugins.DefaultMockitoPlugins.create(DefaultMockitoPlugins.java:103) ... 10 more Caused by: org.mockito.exceptions.base.MockitoInitializationException: Could not initialize inline Byte Buddy mock maker. It appears as if your JDK does not supply a working agent attachment mechanism. Java : 17 JVM vendor name : Oracle Corporation JVM vendor version : 17.0.10+11-LTS-240 JVM name : Java HotSpot(TM) 64-Bit Server VM JVM version : 17.0.10+11-LTS-240 JVM info : mixed mode, sharing OS name : Windows 10 OS version : 10.0 at app//org.mockito.internal.creation.bytebuddy.InlineDelegateByteBuddyMockMaker.<init>(InlineDelegateByteBuddyMockMaker.java:275) at app//org.mockito.internal.creation.bytebuddy.InlineByteBuddyMockMaker.<init>(InlineByteBuddyMockMaker.java:23) ... 13 more Caused by: java.lang.IllegalArgumentException at java.instrument/sun.instrument.InstrumentationImpl.appendToClassLoaderSearch0(Native Method) at java.instrument/sun.instrument.InstrumentationImpl.appendToBootstrapClassLoaderSearch(InstrumentationImpl.java:220) at org.mockito.internal.creation.bytebuddy.InlineDelegateByteBuddyMockMaker.<clinit>(InlineDelegateByteBuddyMockMaker.java:175) ... 14 more > Task :test AuthServiceTest > asd() FAILED java.lang.IllegalStateException at PluginLoader.java:85 Caused by: java.lang.IllegalStateException at DefaultMockitoPlugins.java:105 Caused by: java.lang.reflect.InvocationTargetException at Constructor.java:499 Caused by: org.mockito.exceptions.base.MockitoInitializationException at InlineDelegateByteBuddyMockMaker.java:275 Caused by: java.lang.IllegalArgumentException at InstrumentationImpl.java :-2 1 test completed, 1 failed > Task :test FAILED FAILURE: Build failed with an exception. * What went wrong: Execution failed for task ':test'. > There were failing tests. See the report at: file:///C:/%EC%8A%A4%ED%94%84%EB%A7%81/Artrip/build/reports/tests/test/index.html * Try: > Run with --scan to get full insights. BUILD FAILED in 12s 4 actionable tasks: 2 executed, 2 up-to-date
제가 이전에 진행했던 프로젝트에서 hosts파일을 수정해 실제 운영하고 있는 도메인으로 접속해 아직 개발진행중인 코드를 테스트 했었는데 hosts파일만 수정해서 개발서버,스테이지서버, 운영서버를 왔다갔다 하는것이 정말 신기했었습니다. 그때는 어떤 원리로 동작하는지 모르고 우와 신기하다~ 하며 사용했었는데 이제야 이해가 가네요^^
아바타 만들기 /post 에는 글쓰기, 수정, 상세화면에 대한 정의가 되어 있습니다. /post/[id].tsx /post/write.tsx /post/update/[id].tsx 글쓰기와 수정은 SafeAreaView를 적용하지 않았는데 상세보기에서 적용한 이유와 어떤 기준에 의해 적용하였는지 문의 드립니다. /post/_layout.tsx 내에 Stack.Screen에서 headerShown : false일때 SafeAreaView를 적용하는걸로 생각했는데 그렇지 않은것 같습니다. 감사합니다.
아래와 같은 양식으로 질문을 남겨주세요 🙂 수업을 들으시면 이해하기 어려운 부분이 있으면 상세히 질문을 남겨주세요. 서로 Tone and Manner 를 지키며, 즐거운 수업 시간을 만들어보아요. 잠깐! 인프런 서비스 운영 관련 문의는 1:1 문의하기를 이용해주세요. 강의 pdf가 없는거 같은데 따로 제공해주시지는 않나요? 강의 들을 때 있으면 더 도움될거 같아서 질문드립니다
다른방법으로 풀어서 질문드립니다. 지우는 노드부터 자식으로 내려가서면서 dfs를 돌리며 visited를 체크 했습니다. 너무 비효율적인지? 아니면 이렇게 해도 될지 알려주시면 도움이 될것 같습니다! http://boj.kr/79ae7d2c251d458fa1560fcb789af4ae
버전 호환 문제 현재 강의 흐름대로 react-native 0.79.4 버전을 깔고 이 강의에서 npm install @react-navigation/native 과 npm install react-native-screens react-native-safe-area-context 를 그대로 실행해서 설치하면 npx pod-install ios Need to install the following packages: pod-install@1.0.9 Ok to proceed? (y) y 🔍️ Scanning for pods... 1.16.2 > pod install Found 2 modules for target mapzip2 link_native_modules! {:ios_packages=>[{:configurations=>[], :name=>"react-native-safe-area-context", :root=>"/Users/kwakori/projects/react-native/learning/mapzip2/node_modules/react-native-safe-area-context", :path=>"../node_modules/react-native-safe-area-context", :podspec_path=>"/Users/kwakori/projects/react-native/learning/mapzip2/node_modules/react-native-safe-area-context/react-native-safe-area-context.podspec", :script_phases=>[]}, {:configurations=>[], :name=>"react-native-screens", :root=>"/Users/kwakori/projects/react-native/learning/mapzip2/node_modules/react-native-screens", :path=>"../node_modules/react-native-screens", :podspec_path=>"/Users/kwakori/projects/react-native/learning/mapzip2/node_modules/react-native-screens/RNScreens.podspec", :script_phases=>[]}], :ios_project_root_path=>"/Users/kwakori/projects/react-native/learning/mapzip2/ios", :react_native_path=>"../node_modules/react-native"} Auto-linking React Native modules for target mapzip2: RNScreens and react-native-safe-area-context Framework build type is static library Configuring the target with the New Architecture [!] Invalid Podfile file: [!] /opt/homebrew/bin/node ./../node_modules/react-native/scripts/generate-codegen-artifacts.js -p /Users/kwakori/projects/react-native/learning/mapzip2/ios/.. -o /Users/kwakori/projects/react-native/learning/mapzip2/ios -t ios [Codegen] Analyzing /Users/kwakori/projects/react-native/learning/mapzip2/package.json [Codegen] Searching for codegen-enabled libraries in the app. [Codegen] The "codegenConfig" field is not defined in package.json. Assuming there is nothing to generate at the app level. [Codegen] Searching for codegen-enabled libraries in the project dependencies. [Codegen] Found react-native [Codegen] Found react-native-safe-area-context [Codegen] Found react-native-screens [Codegen] Searching for codegen-enabled libraries in react-native.config.js [Codegen] Processing FBReactNativeSpec [Codegen] Searching for podspec in the project dependencies. [Codegen] Processing rncore [Codegen] Searching for podspec in the project dependencies. [Codegen] Processing safeareacontext [Codegen] Searching for podspec in the project dependencies. [Codegen] Supported Apple platforms: ios, macos, tvos, visionos for safeareacontext [Codegen] Processing rnscreens [Codegen] Searching for podspec in the project dependencies. [Codegen] Supported Apple platforms: ios, tvos, visionos for rnscreens [Codegen] Error: Unknown prop type for "environment": "undefined" [Codegen] Done. . # from /Users/kwakori/projects/react-native/learning/mapzip2/ios/Podfile:20 # ------------------------------------------- # > use_react_native!( # :path => config[:reactNativePath], # ------------------------------------------- Couldn't install Pods. Updating the Pods project and trying again... 와 같은 에러가 발생합니다. 아무래도 버전 호환성 문제인 것 같습니다. https://github.com/software-mansion/react-native-screens/blob/main/README.md#support-for-fabric 위 문서를 참고하면 react-native-screens의 최신 버전인 4.19.0+ 는 react-native 0.81.0+ 에서만 호환된다고 하는 것 같습니다. 강의 들으시는 분들은 참고해주세요. 버전을 낮춰서 설치하시거나 하시면 정상적으로 설치되더라구요 // 아니면 혹시 그냥 react-native를 0.81.0+ 로 설치해서 강의를 들어도 문제없으려나요?
안녕하세요. 우선 강의 정말 잘 수강했습니다. https://pub.dev/packages/flutter_seo 해당 커뮤니티를 보다가 댓글에서 해당 패키지를 찾게되었고 강사님도 해당 seo패키지를 사용해서 seo적용을 하신것같은데, 지금 배포된 샐링잇 웹사이트도 해당 seo패키지만을 적용해서 배포를 하신건지 궁금합니다. 그러면 기존 웹사이트 seo만큼은 아니지만, 저 패키지를 적용하면 회사이름(고유명사) 정도는 구글에 치면 나올 정도로는 적용을 할 수 있는건지 궁금합니다.
안녕하세요. 강의 잘 듣고 있습니다. 강의를 수강하면서 과제 및 개인 프로젝트 진행 방식에 대한 몇 가지 질문이 있어 문의 드립니다. 과제 수행 이전 단계에서, 현재 제공된 강의 영상 내용을 끝까지 모두 수강하며 그대로 따라 하면 PCB 회로도 및 레이아웃 완성본까지 완성되는 구조인지, 아니면 강의 내용을 이해한 뒤 수강자가 추가적인 설계를 수행해야(과제) 최종 PCB가 완성되는 구조인지 궁금합니다. 학습 효율 측면에서 강의 영상을 먼저 전부 수강, 실습한 이후, 그 내용을 바탕으로 개인 과제를 과제 순서에 맞춰 PCB 레이아웃까지 진행하는 방식과 강의 내용을 참고하면서 과제와 유사한 내용으로 병행하여 설계,과제를 진행하는 방식 중 어떤 방식이 더 적절한지 강사님의 권장 방식을 알고 싶습니다. 개인 과제로는 ATMEGA328P-PU 기반의 맞춤혀여 Arduino 호환 보드를 설계하여, 이륜 로봇 제어용으로 사용하고 라즈베리 파이와 통신하는 PCB 제작을 고려하고 있습니다. 이와 관련하여 수업에서 진행되는 설계 흐름과 유사한 방식으로 해당 개인 과제 보드를 설계해나가면 무리가 없는지 여쭤보고싶습니다. 즉 강의에서 제시된 예제를 확장하는 것이 아니라 설계 접근 방식과 절차를 개인 보드에 적용하는 형태의 과제 수행이 가능한지 여쭤보고싶습니다. 긴 질문 읽어주셔서 감사합니다.
안녕하세요 짐코딩님 덕분에 좋은 기능 배우고 있습니다! 일단 윈도우11서 claude code의 pro 이용을 하고 있습니다. 다름 아니라, 계획 검토 및 수정 요청 부분이 궁금해서 질문드립니다...! 저 같은 경우, 처음부터 interactive Question 기능이 나오는 것을 봤을 때, 이 기능이 default인 거 같더라고요 근데 계획을 다 보고, 계획 내용을 수정하고 싶은데, 따로 수정사항을 요청하는 선택지는 없고, esc를 누르면 아예 취소가 되서 미션 중의 3단계를 어떻게 할 수 있을지 궁금해서 질문드립니다!
- 학습 관련 질문을 남겨주세요. 상세히 작성하면 더 좋아요! - 먼저 유사한 질문이 있었는지 검색해보세요. - 서로 예의를 지키며 존중하는 문화를 만들어가요. - 잠깐! 인프런 서비스 운영 관련 문의는 1:1 문의하기를 이용해주세요. Q) LIS 알고리즘이 코딩 테스트에서 자주 사용되는 알고리즘인가요? 실전 코딩 테스트 경험이 적어서 그럴 수 있지만, 이거 LIS로 풀어야겠다 하고 문제 풀이를 들어간 경험이 없어서요. 그냥 알아두면 좋은 알고리즘이라고 생각하고 공부하고 있습니다.
상황은 다음과 같습니다. 100개의 클라이언트 생성했을 때까지는 문제 없는데, 그 보다 더 많은 클라이언트 (ex 200, 500)개로 늘렸을 때 문제입니다. 현재 500개까지 실행했을 때도 500개에대한 OnConnected가 호출되었습니다. 그러다 시간이 좀 지나면 클라이언트와의 연결이 점차 끊겨서 OnDisconnected가 발생합니다. 디버그 했을 때 ClientSession의 OnDisconnected가 호출되었고 스택을 확인했을 때 ClientSession의 OnReceiveCompleted에서 args.BytesTransferred가 0이어서 Disconnect()가 호출되더라구요. 컴퓨터 스펙이 라이젠 7 9800X3D에 렘 96기가여서 컴퓨터 성능 문제는 아닌거같고 뭔가 놓친게 있는거같은데 잘 모르겠네요..