inflearn logo
강의

강의

N
챌린지

챌린지

멘토링

멘토링

N
클립

클립

로드맵

로드맵

지식공유

실전! FastAPI 입문

(실습) Repository Pattern - 레포지토리 패턴

레포지토리 패턴 강의에 pytest 오류가 뜹니다

해결된 질문

325

inflearn1.modeep

작성한 질문수 2

0

pytest 실행하면
FAILED tests/test_main.py::test_get_todos - assert 404 == 200

FAILED tests/test_main.py::test_get_todo - assert 404 == 200

FAILED tests/test_main.py::test_create_todo - AttributeError: 'NoneType' object has no attribute 'id'

FAILED tests/test_main.py::test_update_todo - AssertionError: Expected 'undone' to be called once. Called 0 times.

FAILED tests/test_main.py::test_delete_todo - AttributeError: <module 'api.todo' from 'C:\\Users\\user\\Desktop\\project\\todos\\src\\api\\todo.py'> does not have the attribute 'delete

_todo'
라는 오류가 뜹니다...ㅠㅠ

python 리팩토링 orm FastAPI pytest

답변 1

0

신동현

안녕하세요. 해당 부분은 리팩터링과 테스트 코드 변경이 함께 이루어져서 따라하기 힘드셨을 수도 있을 것 같은데요. 에러가 발생하는 테스트 코드를 공유해주시면 디버깅을 도와드릴 수 있을 것 같습니다.

FasAPI Swagger UI에서 단일조회 todo_id 를 사용했는데, 입력값에 1을 넣으니 오류가 뜹니다 ㅠ

0

171

2

DB 질문

0

133

2

Post API 강의 질문

0

116

2

post 작성 오류

0

181

3

uvicorn 종료 문제

0

698

2

왜 return타입이 ToDo라는 스트링인가요?

0

185

2

ORM 연관관계

0

173

2

Oracle DB 연결과 관련해 질문이 있습니다..

0

218

2

섹션 2, 3의 PATCH API의 차이점

0

189

1

ORM 테이블 생성

0

165

1

테스트 코드 오류

0

216

1

orm relationship 정의 중 해당 에러 발생 시 어떻게 고쳐야 하는걸까요

0

297

3

FastAPI 폴더 구조에 대해 질문이 있습니다.

0

530

2

질문 있습니다.

0

214

2

ORM 개념

0

174

1

mysql root 비밀번호 변경관련

0

419

2

[질문] patch API

0

246

3

디자인 패턴

0

178

1

main.py 리로드문제

0

369

2

인터프리터 오류

0

452

4

로그 저장에 대한 질문입니다.

0

149

1

Internal Server Error

0

294

2

PATCH API - 수정

0

261

2

파이참 임포트 문제

0

324

1