inflearn logo
강의

강의

N
챌린지

챌린지

멘토링

멘토링

N
클립

클립

로드맵

로드맵

지식공유

묻고 답해요

176만명의 커뮤니티!! 함께 토론해봐요.

308 status code

해결됨

AWS 배포 완벽가이드 (feat. Lightsail, Docker, ECS)

안녕하세요. 백그라운드를 먼저 소개해드리자면, 강사님께서 설명해주셨듯 http -> https로 리다이렉션을 시킬 때, 301 status code를 내뱉도록 만들었습니다. 테스트하다가 알게 됐는데, GET 메서드의 경우에는 잘 리다이렉션되지만, POST PUT 메서드의 경우 GET 메서드로 바뀐채 리다이렉션되더라고요. rfc 문서에서는 아래와 같이 설명하고 있습니다. | Note: For historical reasons, a user agent MAY change the request method from POST to GET for the subsequent request. If this behavior is undesired, the 308 (Permanent Redirect) status code can be used instead. 이에 따라 http -> https로 리다이렉션을 시킬 때 POST 나 PUT 인 경우 308 status code를 주려고 했으나, aws 공식문서에는 이를 지원하고 있지 않더라고요. 참고 : https://docs.aws.amazon.com/elasticloadbalancing/latest/application/load-balancer-listeners.html#redirect-actions 보안 그룹에서 http에 대한 요청 자체를 막는것도 하나의 방법이 될거 같긴한데, 강사님께서는 어떻게 해결하실지 궁금해서 질문 남겨봅니다.

  • aws
  • docker
  • ci/cd
  • aws-ecs
한글영문대소문자 댓글 1 좋아요 1 조회수 631

client_loop: send disconnect: Broken pipe

해결됨

AWS 배포 완벽가이드 (feat. Lightsail, Docker, ECS)

안녕하세요 dev push 후 master 에 merge 중 에러가 나서 질문 드립니다! 섹션 4. Github Actions 를 이용한 배포자동화 main branch 보호해주기 강좌를 보고 있는데요 client_loop: send disconnect: Broken pipe 해당 에러가 나고 있지만 domain 으로 접속해보니깐 수정한 텍스트 적용이 잘되더라구요 검색해보니 https://may0301.tistory.com/10 소켓이 닫혀서 nano ~/.ssh/config 파일에 text editor에 Host * ServerAliveInterval 120 TCPKeepAlive no 를 입력 해줘야한다고하는데 혹시 해당 에러가 나는 원인을 알수 있을까요? 위에 검색한대로 소켓이 닫혀서 그럴까요?

  • aws
  • docker
  • ci/cd
  • aws-ecs
huk 댓글 1 좋아요 0 조회수 1998

안녕하세요 ECS를 활용한 ETL 작업 관련해서 질문 드립니다

해결됨

AWS 배포 완벽가이드 (feat. Lightsail, Docker, ECS)

현재 강사님의 강의를 듣고 크롤러와 ETL 배치 파이프라인을 ECS로 배포해서 사용해보려고 합니다 한가지 궁금한 점이 있어 문의드립니다 해당 크롤러와 배치 잡은 모두 api가 아닌 스크립트로 이루어져 있습니다. 이 경우, 클러스터 내 서비스는 생성할 필요 없이, 태스크로만 필요할 때마다 생성하면 되나요? 아님 서비스도 사용하면 좋을까요?

  • aws
  • docker
  • ci/cd
  • aws-ecs
daniel 댓글 3 좋아요 1 조회수 668

create 요청시 에러

해결됨

Golang을 통한 백엔드 개발 및 환경 구축하기

2023/11/16 23:42:58 http: panic serving [::1]:6279: Undefined validation function 'require' on field 'Name' goroutine 21 [running]: net/http.(*conn).serve.func1() C:/Program Files/Go/src/net/http/server.go:1854 +0xbf panic({0x8d4c00, 0xc000061b50}) C:/Program Files/Go/src/runtime/panic.go:890 +0x263 github.com/go-playground/validator/v10.(*Validate).parseFieldTagsRecursive(0xc00014e0e0, {0x8bf3a5?, 0x9661a2?}, {0x8bf38b, 0x4}, {0x0, 0x0}, 0x0) C:/go_gin/pkg/mod/github.com/go-playground/validator/v10@v10.16.0/cache.go:299 +0xa39 github.com/go-playground/validator/v10.(*Validate).extractStructCache(0xc00014e0e0, {0x909600?, 0xc000008108?, 0x1f4e0985898?}, {0x8b7042, 0xd}) C:/go_gin/pkg/mod/github.com/go-playground/validator/v10@v10.16.0/cache.go:156 +0x5ac github.com/go-playground/validator/v10.(*validate).validateStruct(0xc00043a240, {0xa1ce68, 0xc000026158}, {0x909600?, 0xc000008108?, 0xcb2930?}, {0x909600?, 0xc000008108?, 0x0?}, {0xa220a8, ...}, ...) C:/go_gin/pkg/mod/github.com/go-playground/validator/v10@v10.16.0/validator.go:37 +0x19d github.com/go-playground/validator/v10.(*Validate).StructCtx(0xc00014e0e0, {0xa1ce68, 0xc000026158}, {0x909600, 0xc000008108?}) C:/go_gin/pkg/mod/github.com/go-playground/validator/v10@v10.16.0/validator_instance.go:394 +0x479 github.com/go-playground/validator/v10.(*Validate).Struct(...) C:/go_gin/pkg/mod/github.com/go-playground/validator/v10@v10.16.0/validator_instance.go:367 github.com/gin-gonic/gin/binding.(*defaultValidator).validateStruct(0xcb2930, {0x909600, 0xc000008108}) C:/go_gin/pkg/mod/github.com/gin-gonic/gin@v1.9.1/binding/default_validator.go:80 +0x4e github.com/gin-gonic/gin/binding.(*defaultValidator).ValidateStruct(0x909600?, {0x909600?, 0xc000008108?}) C:/go_gin/pkg/mod/github.com/gin-gonic/gin@v1.9.1/binding/default_validator.go:59 +0x189 github.com/gin-gonic/gin/binding.(*defaultValidator).ValidateStruct(0xc000436000?, {0x8e4840?, 0xc0000080c0?}) C:/go_gin/pkg/mod/github.com/gin-gonic/gin@v1.9.1/binding/default_validator.go:57 +0x105 github.com/gin-gonic/gin/binding.validate(...) C:/go_gin/pkg/mod/github.com/gin-gonic/gin@v1.9.1/binding/binding.go:120 github.com/gin-gonic/gin/binding.decodeJSON({0x1f4e0aa8188?, 0xc000038040?}, {0x8e4840, 0xc0000080c0}) C:/go_gin/pkg/mod/github.com/gin-gonic/gin@v1.9.1/binding/json.go:55 +0xa2 github.com/gin-gonic/gin/binding.jsonBinding.Bind({}, 0xa1a460?, {0x8e4840, 0xc0000080c0}) C:/go_gin/pkg/mod/github.com/gin-gonic/gin@v1.9.1/binding/json.go:37 +0x66 github.com/gin-gonic/gin.(*Context).ShouldBindWith(...) C:/go_gin/pkg/mod/github.com/gin-gonic/gin@v1.9.1/context.go:741 github.com/gin-gonic/gin.(*Context).ShouldBindJSON(...) C:/go_gin/pkg/mod/github.com/gin-gonic/gin@v1.9.1/context.go:701 github.com/dev-yakuza/study-golang/gin/start/network.(*userRouter).create(0xc000098080, 0xc00051c100) C:/go_gin/src/CURS_SERVICE/network/user.go:43 +0xbf github.com/gin-gonic/gin.(*Context).Next(...) C:/go_gin/pkg/mod/github.com/gin-gonic/gin@v1.9.1/context.go:174 github.com/gin-gonic/gin.(*Engine).handleHTTPRequest(0xc0000844e0, 0xc00051c100) C:/go_gin/pkg/mod/github.com/gin-gonic/gin@v1.9.1/gin.go:620 +0x66b github.com/gin-gonic/gin.(*Engine).ServeHTTP(0xc0000844e0, {0xa1c940?, 0xc0001920e0}, 0xc00051c000) C:/go_gin/pkg/mod/github.com/gin-gonic/gin@v1.9.1/gin.go:576 +0x1dd net/http.serverHandler.ServeHTTP({0xa1b9d0?}, {0xa1c940, 0xc0001920e0}, 0xc00051c000) C:/Program Files/Go/src/net/http/server.go:2936 +0x316 net/http.(*conn).serve(0xc000190240, {0xa1ced8, 0xc0000907e0}) C:/Program Files/Go/src/net/http/server.go:1995 +0x612 created by net/http.(*Server).Serve C:/Program Files/Go/src/net/http/server.go:3089 +0x5ed 무슨에러인지 알 수 있을까요?

  • aws
  • go
  • crud
  • postman-mocks
JUNI 댓글 2 좋아요 0 조회수 467

1분24초에 go run .를 실행할때 filepath에러

해결됨

Golang을 통한 백엔드 개발 및 환경 구축하기

main에서 filePath에 "./config.toml" 경로를 전달하면 config.go에서 NewConfig함수를 실행할 때 os.Open 에 ./cofig.toml은 결국 config.go가 현재경로 기준이 되는게 아닌가요?

  • aws
  • go
  • crud
  • postman-mocks
댓글 2 좋아요 0 조회수 567

노드몬 에러 참조하세요

미해결

비전공자를 위한 풀스택 맛집지도 만들기 프로젝트!: Front, Back-end 그리고 배포까지

nodemon : 이 시스템에서 스크립트를 실행할 수 없으므로 C:\Users\~~~~~\AppData\Roaming\npm\nodemon.ps1 파일을 로드할 수 없습니다. 자세한 내용은 about_Execution_Policies( https://go.microsoft.com/fwlink/?LinkID=135170 ) 를 참조하십시오. 위치 줄:1 문자:1 + nodemon + ~~~~~~~ + CategoryInfo : 보안 오류: (:) [], PSSecurityException + FullyQualifiedErrorId : UnauthorizedAccess 이런거 뜨면 https://velog.io/@kimy/VS-CODE-supervisor-nodemon-%EC%98%A4%EB%A5%98-ps1-%ED%8C%8C%EC%9D%BC%EC%9D%84-%EB%A1%9C%EB%93%9C%ED%95%A0-%EC%88%98-%EC%97%86%EC%8A%B5%EB%8B%88%EB%8B%A4 이 방법대로 참조하세요 혹시 안되시는분들

  • HTML/CSS
  • javascript
  • aws
  • git
  • mysql
  • rest-api
  • github
퀀텀코더 댓글 1 좋아요 0 조회수 386

깃허브에서 다운받지 않고 생성하는 방법 여쭤보고 싶습니다.

미해결

비전공자를 위한 풀스택 맛집지도 만들기 프로젝트!: Front, Back-end 그리고 배포까지

저 강의에서는 vpm init 등등을 활용해 노드js 기타등등을 생성하셨는데 이번강의에선 깃허브에서 다운을 통해 선생님께서 이미 준비하신 node.js파일들을 제공받았는데.. 만약 제가 스스로 혼자서 셋팅하고 만들어보고 싶은 경우에는 어찌해야 할까요...? 아니면 그냥 선생님이 만들어주신 저 다운패키지들을 활용해도 별 문제 없을까요...?

  • HTML/CSS
  • javascript
  • aws
  • git
  • mysql
  • rest-api
  • github
퀀텀코더 댓글 1 좋아요 0 조회수 354

springframework를 import하는 곳에서 빨간색이 나옵니다.

해결됨

자바와 스프링 부트로 생애 최초 서버 만들기, 누구나 쉽게 개발부터 배포까지! [서버 개발 올인원 패키지]

aws 하기 전에 다시 복습해보고 싶어서 springboot를 하나 다시 만들었습니다. 이때 버전을 3.0.12로 생성을 했구요 그렇게 생성해서 새로운 프로젝트를 열기만 했는데 어떤 에러가 나서 찾아보니 사용자 폴더에 있는 .gradle을 삭제하고 다시 프로젝트를 열어보라고 하더라고요. 그래서 삭제하고 새로 만든 프로젝트를 열어보니까 오류 없이 아주 잘 실행이 됩니다. 그렇게 혼자 배운 것들을 연습하다가 다시 강의 들으면서 작성했던 프로젝트를 열어보니 다 빨간색으로 나오네요.. 스프링에 관련된 거는 모두 빨간색으로 나오는거 같아요 사용자 폴더에 있던 .dradle 폴더를 지워서 이렇게 오류가 나오는 걸까요? 버전에 다른 프로젝트를 만들어서 충돌이 생긴 건지 어떤 이유인지 모르겠습니다. 기존 프로젝트 코드는 건들인게 하나도 없는데 왜 그런거죠? 아 그리고 강의 듣기 전에도 다른 책을 보면서 만든 프로젝트도 있는데 그 프로젝트를 열어보니 똑같이 빨간색으로 나오더라구요. 그 프로젝트도 버전이 3인가 그랬는데... 살려주세요 선생님!!

  • java
  • spring
  • aws
  • mysql
  • spring-boot
  • jpa
하고싶은거하자 댓글 1 좋아요 1 조회수 917

혹시 강의 기한 연장을 부탁드릴수 있을까요?

해결됨

AWS Certified Solutions Architect - Associate 자격증 준비하기

안녕하세요 선생님 다름이 아니라, 혹시 강의 기한 연장을 부탁드릴수 있을까요? 업무에 바쁘다는 핑계로 강의를 제대로 수강하지 못했는데, 강의 기한이 1달 남았습니다 ㅜㅜ 죄송합니다 ㅜㅜ

  • 네트워크
  • aws
delsme 댓글 1 좋아요 1 조회수 237

첨부파일 관련

미해결

AWS(Amazon Web Service) 중/상급자를 위한 강의

안녕하세요, 첨부 파일에 code_revisions 이라는 폴더가 들어있지 않습니다. 감사합니다.

  • aws
  • ci/cd
오랄피 댓글 2 좋아요 0 조회수 320

실전문제풀이4 21번 질문입니다.

미해결

AWS Certified Solutions Architect - Associate 자격증 준비하기

- 학습 관련 질문을 남겨주세요. 상세히 작성하면 더 좋아요! - 먼저 유사한 질문이 있었는지 검색해보세요. - 서로 예의를 지키며 존중하는 문화를 만들어가요. - 잠깐! 인프런 서비스 운영 관련 문의는 1:1 문의하기를 이용해주세요. 문제에서 EC2 인스턴스는 NAT 게이트웨이 아웃바운드 인터넷 엑세스를 사용하지만~ 이라는 구절이 있습니다. 그렇기에 이미 EC2 보안그룹에서 인터넷으로 가는 아웃바운드 규칙은 잘 설정 되어있다고 생각했는데요 정답이 E. EC2 인스턴스에 대한 보안 그룹 연결에 대한 아웃바운드 규칙이 잘못 구성되었습니다 여서 왜 정답이 되는지 궁금해서 질문 남깁니다.

  • 네트워크
  • aws
hyunju1230 댓글 1 좋아요 0 조회수 220

확인부탁드리겠습니다.

미해결

비전공자를 위한 풀스택 맛집지도 만들기 프로젝트!: Front, Back-end 그리고 배포까지

module.exports = { jwtsecret : "jwt_secret_key_9312", host : "3.38.61.157", user : "root", port : "3306", password : "~~~", detabase : "enrolment", }; 이렇게 하고 index.js를 해줬는데 선생님처럼 aws아이피는 안 뜨고 그냥 PS C:\Users\YOONJUNHO\Documents\Test\Node-Template-For-Food-Map-main> node index.js 2023-11-15 02:38:07 info: undefined - API Server Start At Port 3000 이것만 뜨는데 이것도 연결된건가요?

  • HTML/CSS
  • javascript
  • aws
  • git
  • mysql
  • rest-api
  • github
퀀텀코더 댓글 1 좋아요 0 조회수 259

redis Unhandled error. ([ErrorReply: ERR wrong number of arguments for 'auth' command]) 에러

해결됨

AWS 배포 완벽가이드 (feat. Lightsail, Docker, ECS)

안녕하세요 redis-serve 실행까지는 잘되는데 vsCode 에서 yarn test 만 하면 꼭 아래와 같은 에러가 발생합니다. 기본포트로 할때는 되다가 6380 포트로 바꾼이후로 잘안되고 redis 에서도 바뀐포트로 연결하고 비밀번호까지 쳤는데 아래와 같은 에러가 발생합니다. 그리고 제소스가 에러가 나서 제공해주신 express 소스를 압축을 풀어도 같은 에러가 발생을 합니다. 혹시몰라 build 파일을 삭제하고 재빌드후 다시 켜도 아래와 같은 에러가 나는데 혹시 이유를 알 수 있을까요? ● POST /messages › responds with a success message Unhandled error. ([ErrorReply: ERR wrong number of arguments for 'auth' command]) at RedisSocket.<anonymous> (node_modules/@redis/client/dist/lib/client/index.js:396:14) at RedisSocket._RedisSocket_connect (node_modules/@redis/client/dist/lib/client/socket.js:166:18) at Commander.connect (node_modules/@redis/client/dist/lib/client/index.js:184:9) ● GET /messages › responds with all messages Unhandled error. ([ErrorReply: ERR wrong number of arguments for 'auth' command]) at RedisSocket.<anonymous> (node_modules/@redis/client/dist/lib/client/index.js:396:14) at RedisSocket._RedisSocket_connect (node_modules/@redis/client/dist/lib/client/socket.js:166:18) at Commander.connect (node_modules/@redis/client/dist/lib/client/index.js:184:9) ● Test suite failed to run thrown: "Exceeded timeout of 5000 ms for a hook. Add a timeout value to this test to increase the timeout, if this is a long-running test. See https://jestjs.io/docs/api#testname-fn-timeout." 18 | }); 19 | > 20 | afterAll(async () => { | ^ 21 | await client.flushDb(); 22 | await client.quit(); 23 | }); at Object.<anonymous> (app/index.test.ts:20:1) Test Suites: 1 failed, 1 total FAIL app/index.test.ts (101.064 s) ● POST /messages › responds with a success message Unhandled error. ([ErrorReply: ERR wrong number of arguments for 'auth' command]) at RedisSocket.<anonymous> (node_modules/@redis/client/dist/lib/client/index.js:396:14) at RedisSocket._RedisSocket_connect (node_modules/@redis/client/dist/lib/client/socket.js:166:18) at Commander.connect (node_modules/@redis/client/dist/lib/client/index.js:184:9) ● GET /messages › responds with all messages Unhandled error. ([ErrorReply: ERR wrong number of arguments for 'auth' command]) FAIL app/index.test.ts (100.278 s) ● POST /messages › responds with a success message Unhandled error. ([ErrorReply: ERR wrong number of arguments for 'auth' command]) at RedisSocket.<anonymous> (node_modules/@redis/client/dist/lib/client/index.js:396:14) at RedisSocket._RedisSocket_connect (node_modules/@redis/client/dist/lib/client/socket.js:166:18) at Commander.connect (node_modules/@redis/client/dist/lib/client/index.js:184:9) ● GET /messages › responds with all messages Unhandled error. ([ErrorReply: ERR wrong number of arguments for 'auth' command]) at RedisSocket.<anonymous> (node_modules/@redis/client/dist/lib/client/index.js:396:14) at RedisSocket._RedisSocket_connect (node_modules/@redis/client/dist/lib/client/socket.js:166:18) at Commander.connect (node_modules/@redis/client/dist/lib/client/index.js:184:9) ● Test suite failed to run thrown: "Exceeded timeout of 100000 ms for a hook. Add a timeout value to this test to increase the timeout, if this is a long-running test. See https://jestjs.io/docs/api#testname-fn-timeout." 18 | }); 19 | > 20 | afterAll(async () => { | ^ 21 | await client.flushDb(); 22 | await client.quit(); 23 | }, 100000); at Object.<anonymous> (app/index.test.ts:20:1)

  • aws
  • docker
  • ci/cd
  • aws-ecs
huk 댓글 1 좋아요 0 조회수 835

서비스 계층에서 삭제시 @Transactional 사용에 관해

미해결

호돌맨의 요절복통 개발쇼 (SpringBoot, Vue.JS, AWS)

당연히 구글링 해보셨져? 원하는 결과를 못찾으셨나요? 어떤 검색어를 입력했는지 알려주세요. - 검색해보았으나, 원하는 결과를 찾지 못했습니다. 검색어: 서비스 계층에서의 @Transactional 사용 기준 문제가 발생한 코드(프로젝트)를 Github에 올리시고 링크를 알려주세요. ``` java @Transactional public void write(Long postId , CommentCreate request) { Post post = postRepository.findById(postId).orElseThrow(PostNotFound:: new ) ; Comment comment = Comment.builder() .post(post) .author(request.getAuthor()) .password(request.getPassword()) .content(request.getContent()) .build() ; post.addComment(comment) ; } public void delete(Long commentId , CommentDelete request) { Comment comment = commentRepository.findById(commentId).orElseThrow(CommentNotFound:: new ) ; commentRepository.delete(comment) ; } ``` 서비스 계층에서 댓글 작성의 경우 @Transational 적용했지만, 삭제의 경우 적용하지 않았는데 강의에서 이 두 경우의 차이에 대해 이해해야 하고, 찾아보라고 이야기해주셨습니다. 지금까지 제가 공부한 내용에 비추어보면 서비스 게층의 생성 및 삭제의 경우모두 @Transcational 어노테이션을 항상 사용해 왔습니다. 왜냐하면, 수정 삭제의 경우 하나의 트랜잭션에서 시작 및 종료되어야 하기 때문이라고 생각했습니다. 구글링도 해보았는데, 납득할만한 이유를 찾지 못하여 호돌맨님 및 수강생분들에게 질문드립니다.

  • vue.js
  • aws
  • spring-boot
  • jpa
  • spring-security
댓글 2 좋아요 0 조회수 598

WINDOWS에서 실습하는데 따라가기 너무 어렵습니다.

미해결

AWS(Amazon Web Service) 입문자를 위한 강의

[6-3] CloudWatch 실습 강의를 보고 있습니다. WINDOWS와 MAC의 실습 환경이 달라 따라가기가 어렵습니다. WINDOWS에서 실습할 수 있도록 관련 자료를 PDF나 영상으로 만들어주셨으면 좋겠습니다. 실습을 따라하는 시간보다 실습을 진행하기 위해 구글링으로 찾아보는 시간이 더 오래 걸립니다.

  • aws
최지혁 댓글 2 좋아요 0 조회수 441

수강 기한 연장 문의 드립니다.

해결됨

AWS Certified Solutions Architect - Associate 자격증 준비하기

안녕하세요 강사님 ! 좋은 강의 잘 듣고 있습니다! 혹시 강의 기한 연장을 할 수 없을까요? 연말이라 회사일이 너무 바빠서 다 듣지 못했습니다 ㅠㅠ

  • 네트워크
  • aws
밤의멜로디 댓글 1 좋아요 0 조회수 425

클라우드 포메이션 실행시 ROLLBACK_COMPLETE 가 발생해서 CREATE 되지 않습니다ㅠㅠ

해결됨

CloudNet@ - AWS 네트워킹 입문

2023-11-13 16:16:28 UTC+0900 elaalblab ROLLBACK_COMPLETE - 2023-11-13 16:16:28 UTC+0900 ELBVPC DELETE_COMPLETE - 2023-11-13 16:16:27 UTC+0900 MyVPC DELETE_COMPLETE - 2023-11-13 16:16:26 UTC+0900 ELBVPC DELETE_IN_PROGRESS - 2023-11-13 16:16:26 UTC+0900 MyVPC DELETE_IN_PROGRESS - 2023-11-13 16:16:25 UTC+0900 ELBPublicSN1 DELETE_COMPLETE - 2023-11-13 16:16:25 UTC+0900 MyPublicSN DELETE_COMPLETE - 2023-11-13 16:16:25 UTC+0900 ELBIGW DELETE_COMPLETE - 2023-11-13 16:16:25 UTC+0900 ELBPublicRT DELETE_COMPLETE - 2023-11-13 16:16:25 UTC+0900 ELBSG DELETE_COMPLETE - 2023-11-13 16:16:25 UTC+0900 MyPublicRT DELETE_COMPLETE - 2023-11-13 16:16:25 UTC+0900 MyIGW DELETE_COMPLETE - 2023-11-13 16:16:25 UTC+0900 MySG DELETE_COMPLETE - 2023-11-13 16:16:24 UTC+0900 ELBSG DELETE_IN_PROGRESS - 2023-11-13 16:16:24 UTC+0900 ELBPublicSN1 DELETE_IN_PROGRESS - 2023-11-13 16:16:24 UTC+0900 ELBIGW DELETE_IN_PROGRESS - 2023-11-13 16:16:24 UTC+0900 MyPublicSN DELETE_IN_PROGRESS - 2023-11-13 16:16:24 UTC+0900 ELBPublicRT DELETE_IN_PROGRESS - 2023-11-13 16:16:24 UTC+0900 MyPublicRT DELETE_IN_PROGRESS - 2023-11-13 16:16:24 UTC+0900 ELBPublicSN2 DELETE_COMPLETE - 2023-11-13 16:16:24 UTC+0900 MySG DELETE_IN_PROGRESS - 2023-11-13 16:16:24 UTC+0900 MyIGW DELETE_IN_PROGRESS - 2023-11-13 16:16:22 UTC+0900 elaalblab ROLLBACK_IN_PROGRESS The following resource(s) failed to create: [ELBPublicSN1, MyPublicRT, ELBIGW, MyIGW, ELBPublicSN2, MySG, ELBPublicRT, ELBSG, MyPublicSN]. Rollback requested by user. 2023-11-13 16:16:21 UTC+0900 MySG CREATE_FAILED Resource creation cancelled 2023-11-13 16:16:21 UTC+0900 ELBSG CREATE_FAILED Resource creation cancelled 2023-11-13 16:16:18 UTC+0900 MyPublicRT CREATE_FAILED Resource creation cancelled 2023-11-13 16:16:18 UTC+0900 ELBPublicSN1 CREATE_FAILED Resource creation cancelled 2023-11-13 16:16:18 UTC+0900 ELBIGW CREATE_FAILED Resource creation cancelled 2023-11-13 16:16:18 UTC+0900 MyIGW CREATE_FAILED Resource creation cancelled 2023-11-13 16:16:18 UTC+0900 ELBPublicRT CREATE_FAILED Resource creation cancelled 2023-11-13 16:16:18 UTC+0900 MyPublicSN CREATE_FAILED Resource creation cancelled 2023-11-13 16:16:18 UTC+0900 MyPublicSN CREATE_IN_PROGRESS Resource creation Initiated 2023-11-13 16:16:17 UTC+0900 ELBPublicRT CREATE_IN_PROGRESS Resource creation Initiated 2023-11-13 16:16:17 UTC+0900 ELBPublicSN2 CREATE_FAILED Template error: Fn::Select cannot select nonexistent value at index 2 2023-11-13 16:16:16 UTC+0900 MySG CREATE_IN_PROGRESS - 2023-11-13 16:16:16 UTC+0900 MyPublicSN CREATE_IN_PROGRESS - 2023-11-13 16:16:16 UTC+0900 MyPublicRT CREATE_IN_PROGRESS - 2023-11-13 16:16:16 UTC+0900 ELBPublicRT CREATE_IN_PROGRESS - 2023-11-13 16:16:16 UTC+0900 ELBSG CREATE_IN_PROGRESS - 2023-11-13 16:16:16 UTC+0900 ELBPublicSN1 CREATE_IN_PROGRESS - 2023-11-13 16:16:16 UTC+0900 MyVPC CREATE_COMPLETE - 2023-11-13 16:16:16 UTC+0900 ELBVPC CREATE_COMPLETE - 2023-11-13 16:16:05 UTC+0900 MyVPC CREATE_IN_PROGRESS Resource creation Initiated 2023-11-13 16:16:05 UTC+0900 ELBVPC CREATE_IN_PROGRESS Resource creation Initiated 2023-11-13 16:16:05 UTC+0900 ELBIGW CREATE_IN_PROGRESS Resource creation Initiated 2023-11-13 16:16:04 UTC+0900 MyIGW CREATE_IN_PROGRESS Resource creation Initiated 2023-11-13 16:16:03 UTC+0900 ELBIGW CREATE_IN_PROGRESS - 2023-11-13 16:16:03 UTC+0900 ELBVPC CREATE_IN_PROGRESS - 2023-11-13 16:16:03 UTC+0900 MyIGW CREATE_IN_PROGRESS - 2023-11-13 16:16:03 UTC+0900 MyVPC CREATE_IN_PROGRESS - 2023-11-13 16:16:00 UTC+0900 elaalblab CREATE_IN_PROGRESS User Initiated 안녕하세요! 문의드를게 있습니다! cloud formation 을 사용해서 4_lab.yaml 을 적용하면 위같은에러가 지속 발생합니다. 2023-11-13 16:16:17 UTC+0900 ELBPublicSN2 CREATE_FAILED Template error: Fn::Select cannot select nonexistent value at index 2 이 부분이 계속 걸리는거 같은데, 어떻게 수정을 해야할지 감이 잡히지 않습니다. 어떻게 해결하는게 좋을까요??? ㅠㅠ

  • 네트워크
  • aws
  • rollback_complete
JHoon 댓글 5 좋아요 1 조회수 1007

강의대로 트래비스ci 와 aws elastic beanstalk에 포트까지 다 맵핑했는데

미해결

따라하며 배우는 도커와 CI환경 [2023.11 업데이트]

강의와 다르게 도메인을 가면 저는 위 화면이 나옵니다. learn react 라는 화면이 안뜨고 이런 화면이 뜨는 이유는 뭘까요..

  • aws
  • docker
  • github
  • ci/cd
  • travis-ci
  • 데이터-엔지니어링
gonieyoo 댓글 2 좋아요 0 조회수 499

수강 기간 연장 문의드립니다.

해결됨

AWS Certified Solutions Architect - Associate 자격증 준비하기

코드 바바바님, 안녕하세요. 이전에 AWS Certified Cloud Practitioner 강의를 통해 해당 자격증을 취득할 수 있었습니다. 그런데 이번에는 회사 업무와 겹쳐 수강 기한 안에 시험을 못 볼 거 같은데...혹시 수강기한 연장이 가능할까요??

  • 네트워크
  • aws
rainingdaewoo 댓글 1 좋아요 0 조회수 284

git add . 에서 오류가 발생하는데 어떤 문제인가요??

해결됨

자바와 스프링 부트로 생애 최초 서버 만들기, 누구나 쉽게 개발부터 배포까지! [서버 개발 올인원 패키지]

그리고 파일들을 보니까 다 빨간색으로 변해있더라고요 언제부터 변했는지는 모르겠어요. 우선 git 명령어 치기 전까지는 괜찮았어요 오류를 찾아보니까 해당 파일에 .git 파일을 지우고 다시 하라고 했던 것 같은데 그런 파일은 없더라고요 오류에 대해 잘못 찾았나 봐요 ㅎㅎ; ------------------- .git 폴더는 다시 보니까 숨긴 항목으로 숨겨져 있었네요.. .git 폴더 지우고 다시 처음부터 했더니 이상 없습니다!

  • java
  • spring
  • aws
  • mysql
  • spring-boot
  • jpa
하고싶은거하자 댓글 1 좋아요 1 조회수 925

인기 태그

인프런 TOP Writers

주간 인기글