이 부분에 소스를 읽을 수 없는 것 같습니다. discode로 된 다른곳도 마찬가지로 불러오기가 안됩니다. source={{ uri: mock.user.photoURL }} "https://cdn.discordapp.com/attachments/1073889482341875812/1074253729219481690/DALLE_2023-02-11_16.03.49_-_simple_computer_in_90s_modern_art_in_dark_theme.png",
다른 수강생분들에게도 문제 해결에 도움을 줄 수 있도록 좋은 질문을 남겨봅시다 :) 1. 질문은 문제 상황을 최대한 표현해주세요. fly launch 을 하고나서 선생님처럼 docker 파일들이 생기지 않았고 , DataBase 관련 된 질문에 No 를 하고 나서 Error: open Dockerfile : The system cannot find the file specified. 라는 에러가 발생하였습니다. 2. 구체적이고 최대한 맥락을 알려줄 수 있도록 질문을 남겨 주실수록 좋습니다. 그렇지 않으면 답변을 얻는데 시간이 오래걸릴 수 있습니다 ㅠㅠ ex) A라는 상황에서 B라는 문제가 있었고 이에 C라는 시도를 해봤는데 되지 않았다! 3. 먼저 유사한 질문이 있었는지 꼭 검색해주세요!
저 같은 경우에 npm run appcenter-ios-key하면 이 에러가 나왔는데 appcenter login 먼저 하면 브라우저창이 하나 더 뜨면서 액세스키가 나온것을 터미널 창에 입력하는곳에 붙여넣기 하고 진행한다음에 npm run appcenter-ios-key 를 하면 키값이 나왔습니다! 그리고 마지막에 제로초님 codepush:ios 명령어 치고 성공해도 브라우저에 안떠서 브라우저에 떠있는 명령어로 치니까 브라우저에 나타났습니다!
안녕하세요 제로초님 아이폰14프로를 연결해서 하고있는데 티맵이 설치가 안되어 있다고 알림창이 계속 뜹니다 에러는 -canOpenURL: failed for URL: "tmap:" - error: "This app is not allowed to query for scheme tmap" [javascript] 'TMap callback', false 이렇게 뜹니다 다른분 질문보고 info.plist에서 <array><string>tmap</string></array>까지 하고 xcode는 어디에서 설정을 해주어야하는지 모르겠습니다
안녕하세요 제로초님 ios 시뮬레이션에서는 오더 목록까지는 뜨는데 누르면 이 두에러가 뜹니다 참고로 react 버전은 17버전입니다 그리고 안드로이드 시뮬레이터에서는 아예 앱이 안켜지고 아래 에러가 뜹니다 EachOrder 코드에서 빨간줄은 없습니다 npm run android 하면 이에러가 뜹니다 > Configure project :app Reading env from: .env > Configure project :react-native-flipper WARNING:: The specified Android SDK Build Tools version (28.0.3) is ignored, as it is below the minimum supported version (30.0.2) for Android Gradle Plugin 4.2.2. Android SDK Build Tools 30.0.2 will be used. To suppress this warning, remove "buildToolsVersion '28.0.3'" from your build.gradle file, as each version of the Android Gradle Plugin now has a default version of the build tools. > Task :app:packageDebug FAILED 151 actionable tasks: 12 executed, 139 up-to-date Warning: Mapping new ns http://schemas.android.com/repository/android/common/02 to old ns http://schemas.android.com/repository/android/common/01 Warning: Mapping new ns http://schemas.android.com/repository/android/generic/02 to old ns http://schemas.android.com/repository/android/generic/01 Warning: Mapping new ns http://schemas.android.com/sdk/android/repo/addon2/02 to old ns http://schemas.android.com/sdk/android/repo/addon2/01 Warning: Mapping new ns http://schemas.android.com/sdk/android/repo/repository2/02 to old ns http://schemas.android.com/sdk/android/repo/repository2/01 Warning: Mapping new ns http://schemas.android.com/sdk/android/repo/sys-img2/02 to old ns http://schemas.android.com/sdk/android/repo/sys-img2/01 Warning: Mapping new ns http://schemas.android.com/repository/android/common/02 to old ns http://schemas.android.com/repository/android/common/01 Warning: Mapping new ns http://schemas.android.com/repository/android/generic/02 to old ns http://schemas.android.com/repository/android/generic/01 Warning: Mapping new ns http://schemas.android.com/sdk/android/repo/addon2/02 to old ns http://schemas.android.com/sdk/android/repo/addon2/01 Warning: Mapping new ns http://schemas.android.com/sdk/android/repo/repository2/02 to old ns http://schemas.android.com/sdk/android/repo/repository2/01 Warning: Mapping new ns http://schemas.android.com/sdk/android/repo/sys-img2/02 to old ns http://schemas.android.com/sdk/android/repo/sys-img2/01 FAILURE: Build failed with an exception. * What went wrong: Execution failed for task ':app:packageDebug'. > A failure occurred while executing com.android.build.gradle.tasks.PackageAndroidArtifact$IncrementalSplitterRunnable > Java heap space * Try: Run with --stacktrace option to get the stack trace. Run with --info or --debug option to get more log output. Run with --scan to get full insights. * Get more help at https://help.gradle.org BUILD FAILED in 17s error Failed to install the app. Make sure you have the Android development environment set up: https://reactnative.dev/docs/environment-setup. Error: Command failed: ./gradlew app:installDebug -PreactNativeDevServerPort=8081 Warning: Mapping new ns http://schemas.android.com/repository/android/common/02 to old ns http://schemas.android.com/repository/android/common/01 Warning: Mapping new ns http://schemas.android.com/repository/android/generic/02 to old ns http://schemas.android.com/repository/android/generic/01 Warning: Mapping new ns http://schemas.android.com/sdk/android/repo/addon2/02 to old ns http://schemas.android.com/sdk/android/repo/addon2/01 Warning: Mapping new ns http://schemas.android.com/sdk/android/repo/repository2/02 to old ns http://schemas.android.com/sdk/android/repo/repository2/01 Warning: Mapping new ns http://schemas.android.com/sdk/android/repo/sys-img2/02 to old ns http://schemas.android.com/sdk/android/repo/sys-img2/01 Warning: Mapping new ns http://schemas.android.com/repository/android/common/02 to old ns http://schemas.android.com/repository/android/common/01 Warning: Mapping new ns http://schemas.android.com/repository/android/generic/02 to old ns http://schemas.android.com/repository/android/generic/01 Warning: Mapping new ns http://schemas.android.com/sdk/android/repo/addon2/02 to old ns http://schemas.android.com/sdk/android/repo/addon2/01 Warning: Mapping new ns http://schemas.android.com/sdk/android/repo/repository2/02 to old ns http://schemas.android.com/sdk/android/repo/repository2/01 Warning: Mapping new ns http://schemas.android.com/sdk/android/repo/sys-img2/02 to old ns http://schemas.android.com/sdk/android/repo/sys-img2/01 FAILURE: Build failed with an exception. * What went wrong: Execution failed for task ':app:packageDebug'. > A failure occurred while executing com.android.build.gradle.tasks.PackageAndroidArtifact$IncrementalSplitterRunnable > Java heap space * Try: Run with --stacktrace option to get the stack trace. Run with --info or --debug option to get more log output. Run with --scan to get full insights. * Get more help at https://help.gradle.org BUILD FAILED in 17s at makeError (/Users/js/Delivery/node_modules/@react-native-community/cli-platform-android/node_modules/execa/index.js:174:9) at /Users/js/Delivery/node_modules/@react-native-community/cli-platform-android/node_modules/execa/index.js:278:16 at process.processTicksAndRejections (node:internal/process/task_queues:95:5) at async runOnAllDevices (/Users/js/Delivery/node_modules/@react-native-community/cli-platform-android/build/commands/runAndroid/runOnAllDevices.js:109:5) at async Command.handleAction (/Users/js/Delivery/node_modules/@react-native-community/cli/build/index.js:192:9) info Run CLI with --verbose flag for more details.
fiy.io강의 진행 후 vercel에 그맵마켓 웹 배포하기 강의 진행했는데 화면에 데이터를 못받아 오고 있습니다. 정말 죄송한데 원인을 잘 모르겠어요.. 어떤 부분을 어떻게 찾아봐야할까요.. fly.io에서 URL에 안들어가지는게 뭔가 이상한거같은데..안돌아가고 있다는 느낌이랄까요 greb-market-server에서 fly deploy에러나는데 이거때문일까여? PS D:\VScode\grab-market-server> fly deploy ==> Verifying app config Validating D:\VScode\grab-market-server\fly.toml Platform: machines ✓ Configuration is valid --> Verified app config ==> Building image Remote builder fly-builder-blue-feather-4034 ready ==> Creating build context --> Creating build context done ==> Building image with Docker --> docker host: 20.10.12 linux x86_64 [+] Building 23.1s (0/1) [+] Building 12.9s (12/14) => CACHED [internal] load remote build context 0.0s => CACHED copy /context / 0.0s => resolve image config for docker.io/docker/dockerfile:1 1.9s => CACHED docker-image:// docker.io/docker/dockerfile:1@sha256:39b85bbfa7536a5feceb7372a0817649e 0.0s => [internal] load metadata for docker.io/library/node:16.17.1-slim 0.6s => [base 1/2] FROM docker.io/library/node:16.17.1-slim@sha256:1f6cbe8654b31c214225bddd12451b857 0.0s => CACHED [base 2/2] WORKDIR /app 0.0s => CACHED [build 1/6] RUN apt-get update -qq && apt-get install -y python pkg-config build- 0.0s => CACHED [build 2/6] COPY --link package.json package-lock.json ./ 0.0s => CACHED [build 3/6] RUN npm ci --include=dev 0.0s => CACHED [build 4/6] COPY --link . . 0.0s => ERROR [build 5/6] RUN npm run build 10.3s ------ > [build 5/6] RUN npm run build: #12 0.549 #12 0.549 > grab-market-server@0.1.0 build #12 0.549 > react-scripts build #12 0.549 #12 1.839 Creating an optimized production build... #12 10.22 Failed to compile. #12 10.22 #12 10.22 ./src/App.js #12 10.22 Line 6: 'React' must be in scope when using JSX react/react-in-jsx-scope #12 10.22 Line 7: 'React' must be in scope when using JSX react/react-in-jsx-scope #12 10.22 Line 8: 'React' must be in scope when using JSX react/react-in-jsx-scope #12 10.22 Line 9: 'React' must be in scope when using JSX react/react-in-jsx-scope #12 10.22 Line 10: 'React' must be in scope when using JSX react/react-in-jsx-scope #12 10.22 Line 12: 'React' must be in scope when using JSX react/react-in-jsx-scope #12 10.22 #12 10.22 Search for the keywords to learn more about each error. #12 10.22 #12 10.22 ------ Error: failed to fetch an image or build from source: error building: executor failed running [/bin/sh -c npm run build]: exit code: 1