학습하는 분들께 도움이 되고, 더 좋은 답변을 드릴 수 있도록 질문전에 다음을 꼭 확인해주세요. 1. 강의 내용과 관련된 질문을 남겨주세요. 2. 인프런의 질문 게시판과 자주 하는 질문(링크)을 먼저 확인해주세요. (자주 하는 질문 링크: https://bit.ly/3fX6ygx) 3. 질문 잘하기 메뉴얼(링크)을 먼저 읽어주세요. (질문 잘하기 메뉴얼 링크: https://bit.ly/2UfeqCG) 질문 시에는 위 내용은 삭제하고 다음 내용을 남겨주세요. ========================================= [질문 템플릿] 1. 강의 내용과 관련된 질문인가요? (예/아니오) 2. 인프런의 질문 게시판과 자주 하는 질문에 없는 내용인가요? (예/아니오) 3. 질문 잘하기 메뉴얼을 읽어보셨나요? (예/아니오) [질문 내용] 이렇게 2개의 이미지처럼 자바 11로 설정을 하고 매인 메소드를 실행했는데 위 이미지처럼 나옵니다 자바 17 버전을 깔아야하는걸까요? 스프링 부트 버전도 2.7.13 입니다
어떤 툴을 (버전까지..) 사용하셔서 다이어그램을 그렸는지 궁금하고 또 3가지 다이어그램이 각각 어떤 다이어그램인지 종류별로 알려주시면 감사하겠습니다... 제가 프로젝트 만들기전에 StarUML 5.1 버전로 구체적으로 그려보려고 하는데, 김영한 선생님이 그린것과는 다른느낌으로 그려져서 이게 클래스 다이어그램인지, 오브젝트 다이어그램인지 엔티티다이어그램인지 도통 모르겠어요ㅜ 1번) 2번 3번)
H2 DB에 테이블도 생기고 테스트 모두 완료 후(강의시간 20분 정도 모두 완료) cmd에서 gradlew clean build하니 테스트 모두 오류 뜨면서 localhost 8082도 연결도 끊겼고 intellij에서도 access 됐던 테스트가 모두 되지 않는 상태입니다. intellij에서는 현재 이런 오류가 발생하며 코드는 모두 강의자료에서 복붙해둔 상태고 Junit5 사용중입니다.
학습하는 분들께 도움이 되고, 더 좋은 답변을 드릴 수 있도록 질문전에 다음을 꼭 확인해주세요. 1. 강의 내용과 관련된 질문을 남겨주세요. 2. 인프런의 질문 게시판과 자주 하는 질문(링크)을 먼저 확인해주세요. (자주 하는 질문 링크: https://bit.ly/3fX6ygx) 3. 질문 잘하기 메뉴얼(링크)을 먼저 읽어주세요. (질문 잘하기 메뉴얼 링크: https://bit.ly/2UfeqCG) 질문 시에는 위 내용은 삭제하고 다음 내용을 남겨주세요. ========================================= [질문 템플릿] 1. 강의 내용과 관련된 질문인가요? (예/아니오) 2. 인프런의 질문 게시판과 자주 하는 질문에 없는 내용인가요? (예/아니오) 3. 질문 잘하기 메뉴얼을 읽어보셨나요? (예/아니오) [질문 내용] 꼭 코드를 따라치면서 안해도 되나여? 진행이 너무 빨라서 이해가 안되서 머하는지도 모르고 따라치면서 지나가는 것 같은데 그냥 차라리 머릿속으로 흐름만 이해를 하고 넘어가는게 더 효율적인가여? 진행이 너무 늦어서서 질문 드립니다 죄송합니다 ㅜㅜ
안녕하세요! 강의 섹션1 h2 데이터베이스 설치 관련해서 따라하던중 오류가 발생해 문의글남깁니다. 지난 입문편 강의를 들을때 h2 데이터베이스를 잘 활용했고 이번에 jpa강의를 들으며 h2 데이터베이스를 생성하고 있는데 연결이 안되는 문제가 발생했습니다. 우선, 저는 스프링부트 3버전으로 진행을 하고 있어 입문편 강의록에서 안내해주신대로 h2 2.1.214버전으로 진행중입니다. 윈도우 사용자라 h2.bat파일을 실행하고, h2 console이 열린 다음에 url을 localhost로 변경하고 JDBC URL에 jdbc:h2:~/jpashop을 입력하고 연결하기를 눌렀더니 아래와 같은 에러가 발생합니다. 관련 디렉토리를 찾지 못해서 발생하는 에러라고 생각되어 해당 경로인 C:/Users/user에 jpashop이라는 폴더를 만들어 다시 실행해봐도 결과는 똑같았습니다. 또한, 해당 jpashop 폴더가 저희 프로젝트 폴더의 경로와 동일해야하나하는 의문이 들어 제 프로젝트 파일은 E드라이브에 있는데, 프로젝트 폴더를 옮겨야하나.. 하는 의문이 들기도 합니다. 경로 설정 문제인듯한데 적절한 해결책을 알려주시면 대단히 감사하겠습니다 .. 저는 환경설정이 너무 어려워요 ㅠ.ㅠ 하하... https://abcdefgh123123.tistory.com/331 이글 보고 해결했습니당 참고하세요 다들!
학습하는 분들께 도움이 되고, 더 좋은 답변을 드릴 수 있도록 질문전에 다음을 꼭 확인해주세요. 1. 강의 내용과 관련된 질문을 남겨주세요. 2. 인프런의 질문 게시판과 자주 하는 질문(링크)을 먼저 확인해주세요. (자주 하는 질문 링크: https://bit.ly/3fX6ygx) 3. 질문 잘하기 메뉴얼(링크)을 먼저 읽어주세요. (질문 잘하기 메뉴얼 링크: https://bit.ly/2UfeqCG) 질문 시에는 위 내용은 삭제하고 다음 내용을 남겨주세요. ========================================= [질문 템플릿] 1. 강의 내용과 관련된 질문인가요? (예/아니오) 2. 인프런의 질문 게시판과 자주 하는 질문에 없는 내용인가요? (예/아니오) 3. 질문 잘하기 메뉴얼을 읽어보셨나요? (예/아니오) [질문 내용] 여기에 질문 내용을 남겨주세요. findByName에서 자꾸 오류가 뜹니다 ㅠㅠ 근데 그게 정확한 이유가 뭔지 모르겠어요 Member.java package hwang.hwangspring.domain; public class Member { private Long id; //시스템이 정해줌 private String name; //고객이 회원가입할 때 적는 이름 public Long getId() { return id; } public void setId(Long id) { this.id = id; } public String getName() { return name; } public void setName(String name) { this.name = name; } } MemoryMemberRepository.java package hwang.hwangspring.repository; import hwang.hwangspring.domain.Member; import java.util.*; public class MemoryMemberRepository implements MemberRepository{ private static Map<Long,Member> store = new HashMap<>(); private static long sequence= 0L; //0,1,2 키값을 생성 @Override public Member save(Member member) { member.setId(++sequence); store.put(member.getId(), member); return member; } @Override public Optional<Member> findById(Long id) { return Optional.ofNullable(store.get(id)); } @Override public Optional<Member> findByName(String name) { return store.values().stream() .filter(member -> member.getName().equals(name)) .findAny(); } @Override public List<Member> findAll() { //실무에서 List 많이 씀 return new ArrayList<>(store.values()); } } package hwang.hwangspring.repository; import hwang.hwangspring.domain.Member; import org.junit.jupiter.api.Assertions; import org.junit.jupiter.api.Test; import static org.assertj.core.api.Assertions.*; class MemoryMemberRepositoryTest { //굳이 public x, 따른데서 갖다쓸게 아니니까.. MemberRepository repository = new MemoryMemberRepository(); @Test public void save(){ Member member = new Member(); //멤버 생성 member.setName("Hwang"); repository.save(member); Member result = repository.findById(member.getId()).get(); //System.out.println("result = "+(result==member)); //Assertions.assertEquals(member,result); //expected, actual assertThat(result).isEqualTo(member); } @Test public void findByName(){ Member member1 = new Member(); member1.setName("seo"); repository.save(member1); Member member2 = new Member(); member1.setName("hyun"); repository.save(member2); Member result= repository.findByName("seo").get(); assertThat(result).isEqualTo(member1); } }
[질문 템플릿] 1. 강의 내용과 관련된 질문인가요? (예) 2. 인프런의 질문 게시판과 자주 하는 질문에 없는 내용인가요? (예) 3. 질문 잘하기 메뉴얼을 읽어보셨나요? (예) [질문 내용] 여기에 질문 내용을 남겨주세요 안녕하세요. 구글링을 해봤는데도 딱히 답을 찾지 못해 질문 남깁니다. run을 실행하면 계속 이렇게만 뜨는데 뭐가 문제인지 저 사이트 두 개를 다 참고해도 이해가 되질 않아 질문 남깁니다. gradle task를 어떻게 실행해야지 run이 될까요?
Whitelabel Error Page This application has no explicit mapping for /error, so you are seeing this as a fallback. Tue Jul 04 23:39:24 KST 2023 There was an unexpected error (type=Not Found, status=404). No message available 404 애매합니다. 소스를 보내도록 하겠습니다.
실전! 코틀린과 스프링 부트로 도서관리 애플리케이션 개발하기 (Java 프로젝트 리팩토링)
안녕하세요. Sto라는 부모 엔티티가 있습니다. 자식으로는 Realestate 라는 엔티티가 있습니다. 해당 엔티티의 관계는 Sto + Realestate 이렇게 1개의 쌍을 이루어 생성이 됩니다. 저는 @OneToOne 양뱡향 관계를 사용하고 있습니다. cascade 속성을 이용하여, Sto를 save 했을 때 하위 엔티티까지 함께 저장하려고 하고 있습니다. 이때, 모든 엔티티를 val를 사용하려고 했는데 Sto 생성자 호출 시 하위 엔티티에서 Sto 엔티티의 값을 알 수가 없어서 생성이 불가한 상태입니다. 물리적으로 Sto + Realestate는 한쌍인데 방법이 없을까 싶어 문의드립니다. var + null을 사용하면, 어떻게든 할 수 있을 것 같은데 양방향 설정을 위해 이렇게 풀어서 사용해야 하나 궁금하네요.. @Entity @Table(name = "sto") class Sto( @Id @Column(name = "sto_id", nullable = false) private val id: String, @OneToOne( mappedBy = "sto", cascade = [CascadeType.PERSIST] ) val realestate: Realestate, @OneToOne( mappedBy = "sto", cascade = [CascadeType.PERSIST] ) val youtube: Youtube, ) @Entity class Realestate( @Id @Column(name = "realestate_id", nullable = false) private val id: String, @OneToOne(fetch = FetchType.LAZY) @JoinColumn(name = "sto_id", nullable = false) val sto: Sto, ) fun main() { Sto( id = "sto_id", realestate = Realestate( id = "realestate_id", sto = 여기가 문제네요.. ) ) }
실전! 코틀린과 스프링 부트로 도서관리 애플리케이션 개발하기 (Java 프로젝트 리팩토링)
개인적으로 공부를 하던 중 잘 풀리지 않아 문의드리게 되었습니다 .java .kt 다름이 아니라 실행시점에 샘플 데이터를 미리 저장시켜두고 싶어서 자바로 작성했던 위의 코드를 아래와 같이 코틀린으로 변경 후에 실행을 시켜보았습니다. 그런데 실행을 시키면 CGLIB, subclass 등 오류가 발생해서 구글 검색을 통해 최대한 해결해보려 하였으나, allOpen 설정도 해보고 이것저것 해보았음에도 해결하지 못해서 이렇게 염치불구하고 문의드리게 되었습니다 ㅜ 혹시 어떤 문제인지 아실까요??
자바와 스프링 부트로 생애 최초 서버 만들기, 누구나 쉽게 개발부터 배포까지! [서버 개발 올인원 패키지]
제가 이클립스를 사용하고 있는데 JdbcTemplate 에서 오류가 나요,, build.gradle파일에서 아래와 같이 의존성 설정도 했습니다.. 구글링을 해봐도 잘모르겠어서 여쭤봅니다ㅜ... implementation 'org.springframework.boot:spring-boot-starter-jdbc' runtimeOnly 'mysql:mysql-connector-java'
[질문 템플릿] 1. 강의 내용과 관련된 질문인가요? 아니오 2. 인프런의 질문 게시판과 자주 하는 질문에 없는 내용인가요? 예 3. 질문 잘하기 메뉴얼을 읽어보셨나요? 아니오 [질문 내용] 안녕하세요. 정확히 강의 내용과 일치하는 내용은 아니지만 JPA 를 공부하다 궁금한 부분이 생겨 질문드립니다. save() 와 saveAndFlush() 의 차이점은 saveAndFlush() 시에는 즉시 DB 로 flush 가 일어나 DB 에 변경내역이 동기화되는 차이가 있는 것으로 알고 있습니다. 하지만 그렇다고 해서 commit 이 일어난 것은 아니기 때문에 다른 트랜잭션에서 변경된 내용을 확인할 수 있는 것도 아닐 것 같습니다. (READ UNCOMMIT 격리수준이 아니라면) 변경된 내역을 확인 가능한 곳은 같은 트랜잭션에 한정된 부분이라면 굳이 flush 를 하지 않아도 1차캐시와 쓰기지연저장소에서 확인이 가능한 부분일 것 같은데 saveAndFlush() 를 왜 사용해야 하는 것인지 궁금합니다.
[질문 템플릿] 1. 강의 내용과 관련된 질문인가요? (아니오) 2. 인프런의 질문 게시판과 자주 하는 질문에 없는 내용인가요? (예) 3. 질문 잘하기 메뉴얼을 읽어보셨나요? (예) [질문 내용] 안녕하세요. 메소드의 접근제한자에 따른 NullPointerException 오류에 궁금한 점이 생겨 질문 드립니다. 문제는 해결하여 프로그램은 정상적으로 실행되나, 왜 이런 현상이 나타나는지 궁금합니다. 문제 상황 MemberController.java @PostMapping("/members/new") private String create(MemberForm form) { Member member = new Member(); member.setName(form.getName()); memberService.join(member); return "redirect:/"; } 오류 로그 [dispatcherServlet]: Servlet.service() for servlet [dispatcherServlet] in context with path [] threw exception [Request processing failed; nested exception is java.lang.NullPointerException] with root cause java.lang.NullPointerException: null at Hello.hellospring.controller.MemberController.create(MemberController.java:32) 해결 방법 @PostMapping("/members/new") public String create(MemberForm form) { Member member = new Member(); member.setName(form.getName()); memberService.join(member); return "redirect:/"; } 궁금한 점 create 메소드의 접근제한자를 private에서 public으로 변경함으로서 해결은 했지만 왜 NullPointerException이 발생하는 건지 모르겠습니다. join 메소드에서 리턴 값을 반환할 때 create 메소드에 접근할 수 없어서인가요?
학습하는 분들께 도움이 되고, 더 좋은 답변을 드릴 수 있도록 질문전에 다음을 꼭 확인해주세요. 1. 강의 내용과 관련된 질문을 남겨주세요. 2. 인프런의 질문 게시판과 자주 하는 질문(링크)을 먼저 확인해주세요. (자주 하는 질문 링크: https://bit.ly/3fX6ygx) 3. 질문 잘하기 메뉴얼(링크)을 먼저 읽어주세요. (질문 잘하기 메뉴얼 링크: https://bit.ly/2UfeqCG) 질문 시에는 위 내용은 삭제하고 다음 내용을 남겨주세요. ========================================= [질문 템플릿] 1. 강의 내용과 관련된 질문인가요? (예) 2. 인프런의 질문 게시판과 자주 하는 질문에 없는 내용인가요? (아니오) 3. 질문 잘하기 메뉴얼을 읽어보셨나요? (예) [질문 내용] HelloSpringApplicationTest.java 실행시 port 8080이 보이질 않습니다.. ㅠㅠ 혹시 잘못 설정한 부분이 있을까해서 질문드려요! . ____ _ /\\ / ___'_ __ ( _)_ _ \ \ \ \ ( ( )\___ | '_ | '_| | '_ \/ _` | \ \ \ \ \\/ ___)| |_)| | | | | || (_| | ) ) ) ) ' |____| .__|_| |_|_| |_\__, | / / / / =========|_|==============|___/=/_/_/_/ :: Spring Boot :: (v2.4.8) 2023-07-04 10:27:08.787 INFO 8208 --- [ Test worker] h.h.HelloSpringApplicationTests : Starting HelloSpringApplicationTests using Java 11.0.19 on DESKTOP-KFLGKRQ with PID 8208 (started by Parkjinsu in C:\hello-spring) 2023-07-04 10:27:08.795 INFO 8208 --- [ Test worker] h.h.HelloSpringApplicationTests : No active profile set, falling back to default profiles: default 2023-07-04 10:27:15.557 INFO 8208 --- [ Test worker] h.h.HelloSpringApplicationTests : Started HelloSpringApplicationTests in 7.862 seconds (JVM running for 13.144) BUILD SUCCESSFUL in 16s 4 actionable tasks: 1 executed, 3 up-to-date 오전 10:27:17: Execution finished ':test --tests "hello.hellospring.HelloSpringApplicationTests.contextLoads"'.
MemberServiceIntergratinTest 파트 듣는중입니다. 회원조회 test 실행했는데 오류가 나서 h2 에 들어가서 drop table member if exists 입력해서 member 가 사라진것 확인하고 member 테이블 다시 만들고 HelloSpringApplication 실행하고 localhost 들어가서 회원가입 들어가서 등록하기 누르면 등록 이 안됩니다.ㅠ 왜 갑자기 안되는 걸까요 그리고 MemberServiceIntergrationTest도 join 부분 실행하면 오류가 뜨는데 뭐가 문제인지 한 번 확인 부탁드립니다.. > Task :compileJava UP-TO-DATE > Task :processResources UP-TO-DATE > Task :classes UP-TO-DATE > Task :compileTestJava > Task :processTestResources NO-SOURCE > Task :testClasses > Task :test 01:14:28.977 [Test worker] DEBUG org.springframework.test.context.BootstrapUtils - Instantiating CacheAwareContextLoaderDelegate from class [org.springframework.test.context.cache.DefaultCacheAwareContextLoaderDelegate] 01:14:28.984 [Test worker] DEBUG org.springframework.test.context.BootstrapUtils - Instantiating BootstrapContext using constructor [public org.springframework.test.context.support .DefaultBootstrapContext(java.lang.Class,org.springframework.test.context.CacheAwareContextLoaderDelegate)] 01:14:29.011 [Test worker] DEBUG org.springframework.test.context.BootstrapUtils - Instantiating TestContextBootstrapper for test class [hello.hellospring.service.MemberServiceIntegrationTest] from class [org.springframework.boot.test.context.SpringBootTestContextBootstrapper] 01:14:29.021 [Test worker] INFO org.springframework.boot.test.context.SpringBootTestContextBootstrapper - Neither @ContextConfiguration nor @ContextHierarchy found for test class [hello.hellospring.service.MemberServiceIntegrationTest], using SpringBootContextLoader 01:14:29.024 [Test worker] DEBUG org.springframework.test.context.support .AbstractContextLoader - Did not detect default resource location for test class [hello.hellospring.service.MemberServiceIntegrationTest]: class path resource [hello/hellospring/service/MemberServiceIntegrationTest-context.xml] does not exist 01:14:29.024 [Test worker] DEBUG org.springframework.test.context.support .AbstractContextLoader - Did not detect default resource location for test class [hello.hellospring.service.MemberServiceIntegrationTest]: class path resource [hello/hellospring/service/MemberServiceIntegrationTestContext.groovy] does not exist 01:14:29.026 [Test worker] INFO org.springframework.test.context.support .AbstractContextLoader - Could not detect default resource locations for test class [hello.hellospring.service.MemberServiceIntegrationTest]: no resource found for suffixes {-context.xml, Context.groovy}. 01:14:29.026 [Test worker] INFO org.springframework.test.context.support .AnnotationConfigContextLoaderUtils - Could not detect default configuration classes for test class [hello.hellospring.service.MemberServiceIntegrationTest]: MemberServiceIntegrationTest does not declare any static, non-private, non-final, nested classes annotated with @Configuration. 01:14:29.061 [Test worker] DEBUG org.springframework.test.context.support .ActiveProfilesUtils - Could not find an 'annotation declaring class' for annotation type [org.springframework.test.context.ActiveProfiles] and class [hello.hellospring.service.MemberServiceIntegrationTest] 01:14:29.116 [Test worker] DEBUG org.springframework.context.annotation.ClassPathScanningCandidateComponentProvider - Identified candidate component class: file [C:\Users\류미양\Desktop\hello-spring\build\classes\java\main\hello\hellospring\HelloSpringApplication.class] 01:14:29.120 [Test worker] INFO org.springframework.boot.test.context.SpringBootTestContextBootstrapper - Found @SpringBootConfiguration hello.hellospring.HelloSpringApplication for test class hello.hellospring.service.MemberServiceIntegrationTest 01:14:29.227 [Test worker] DEBUG org.springframework.boot.test.context.SpringBootTestContextBootstrapper - @TestExecutionListeners is not present for class [hello.hellospring.service.MemberServiceIntegrationTest]: using defaults. 01:14:29.227 [Test worker] INFO org.springframework.boot.test.context.SpringBootTestContextBootstrapper - Loaded default TestExecutionListener class names from location [META-INF/spring.factories]: [org.springframework.boot.test.autoconfigure.restdocs.RestDocsTestExecutionListener, org.springframework.boot.test.autoconfigure.web.client.MockRestServiceServerResetTestExecutionListener, org.springframework.boot.test.autoconfigure.web.servlet.MockMvcPrintOnlyOnFailureTestExecutionListener, org.springframework.boot.test.autoconfigure.web.servlet.WebDriverTestExecutionListener, org.springframework.boot.test.autoconfigure.webservices.client.MockWebServiceServerTestExecutionListener, org.springframework.boot.test.mock.mockito.MockitoTestExecutionListener, org.springframework.boot.test.mock.mockito.ResetMocksTestExecutionListener, org.springframework.test.context.web.ServletTestExecutionListener, org.springframework.test.context.support .DirtiesContextBeforeModesTestExecutionListener, org.springframework.test.context.event.ApplicationEventsTestExecutionListener, org.springframework.test.context.support .DependencyInjectionTestExecutionListener, org.springframework.test.context.support .DirtiesContextTestExecutionListener, org.springframework.test.context.transaction.TransactionalTestExecutionListener, org.springframework.test.context.jdbc.SqlScriptsTestExecutionListener, org.springframework.test.context.event.EventPublishingTestExecutionListener] 01:14:29.246 [Test worker] INFO org.springframework.boot.test.context.SpringBootTestContextBootstrapper - Using TestExecutionListeners: [org.springframework.test.context.web.ServletTestExecutionListener@10b3df93, org.springframework.test.context.support .DirtiesContextBeforeModesTestExecutionListener@ea27e34, org.springframework.test.context.event.ApplicationEventsTestExecutionListener@33a2499c, org.springframework.boot.test.mock.mockito.MockitoTestExecutionListener@e72dba7, org.springframework.boot.test.autoconfigure.SpringBootDependencyInjectionTestExecutionListener@33c2bd, org.springframework.test.context.support .DirtiesContextTestExecutionListener@1dfd5f51, org.springframework.test.context.transaction.TransactionalTestExecutionListener@3c321bdb, org.springframework.test.context.jdbc.SqlScriptsTestExecutionListener@24855019, org.springframework.test.context.event.EventPublishingTestExecutionListener@3abd581e, org.springframework.boot.test.autoconfigure.restdocs.RestDocsTestExecutionListener@4d4d8fcf, org.springframework.boot.test.autoconfigure.web.client.MockRestServiceServerResetTestExecutionListener@610db97e, org.springframework.boot.test.autoconfigure.web.servlet.MockMvcPrintOnlyOnFailureTestExecutionListener@6f0628de, org.springframework.boot.test.autoconfigure.web.servlet.WebDriverTestExecutionListener@3fabf088, org.springframework.boot.test.autoconfigure.webservices.client.MockWebServiceServerTestExecutionListener@1e392345, org.springframework.boot.test.mock.mockito.ResetMocksTestExecutionListener@12f3afb5] 01:14:29.249 [Test worker] DEBUG org.springframework.test.context.support .AbstractDirtiesContextTestExecutionListener - Before test class: context [DefaultTestContext@1e53135d testClass = MemberServiceIntegrationTest, testInstance = [null], testMethod = [null], testException = [null], mergedContextConfiguration = [WebMergedContextConfiguration@7674a051 testClass = MemberServiceIntegrationTest, locations = '{}', classes = '{class hello.hellospring.HelloSpringApplication}', contextInitializerClasses = '[]', activeProfiles = '{}', propertySourceLocations = '{}', propertySourceProperties = '{org.springframework.boot.test.context.SpringBootTestContextBootstrapper=true}', contextCustomizers = set[org.springframework.boot.test.autoconfigure.actuate.metrics.MetricsExportContextCustomizerFactory$DisableMetricExportContextCustomizer@42f48531, org.springframework.boot.test.autoconfigure.properties .PropertyMappingContextCustomizer@0, org.springframework.boot.test.autoconfigure.web.servlet.WebDriverContextCustomizerFactory$Customizer@ea9b7c6, org.springframework.boot.test.context.filter.ExcludeFilterContextCustomizer@a8e6492, org.springframework.boot.test.json.DuplicateJsonObjectContextCustomizerFactory$DuplicateJsonObjectContextCustomizer@60dce7ea, org.springframework.boot.test.mock.mockito.MockitoContextCustomizer@0, org.springframework.boot.test.web.client.TestRestTemplateContextCustomizer@f73dcd6, org.springframework.boot.test.context.SpringBootTestArgs@1, org.springframework.boot.test.context.SpringBootTestWebEnvironment@7bf3a5d8], resourceBasePath = 'src/main/webapp', contextLoader = 'org.springframework.boot.test.context.SpringBootContextLoader', parent = [null]], attributes = map['org.springframework.test.context.web.ServletTestExecutionListener.activateListener' -> true]], class annotated with @DirtiesContext [false] with mode [null]. . ____ _ /\\ / ___'_ __ ( _)_ _ \ \ \ \ ( ( )\___ | '_ | '_| | '_ \/ _` | \ \ \ \ \\/ ___)| |_)| | | | | || (_| | ) ) ) ) ' |____| .__|_| |_|_| |_\__, | / / / / =========|_|==============|___/=/_/_/_/ :: Spring Boot :: (v2.7.11) 2023-07-04 01:14:29.659 INFO 2132 --- [ Test worker] h.h.s.MemberServiceIntegrationTest : Starting MemberServiceIntegrationTest using Java 11.0.19 on DESKTOP-LJ47PUR with PID 2132 (started by 류미양 in C:\Users\류미양\Desktop\hello-spring) 2023-07-04 01:14:29.662 INFO 2132 --- [ Test worker] h.h.s.MemberServiceIntegrationTest : No active profile set, falling back to 1 default profile: "default" 2023-07-04 01:14:31.232 INFO 2132 --- [ Test worker] o.s.b.a.w.s.WelcomePageHandlerMapping : Adding welcome page: class path resource [static/index.html] 2023-07-04 01:14:31.739 INFO 2132 --- [ Test worker] h.h.s.MemberServiceIntegrationTest : Started MemberServiceIntegrationTest in 2.448 seconds (JVM running for 3.901) 2023-07-04 01:14:31.791 INFO 2132 --- [ Test worker] com.zaxxer.hikari.HikariDataSource : HikariPool-1 - Starting... 2023-07-04 01:14:37.004 ERROR 2132 --- [ Test worker] com.zaxxer.hikari.pool.HikariPool : HikariPool-1 - Exception during pool initialization. org.h2.jdbc.JdbcSQLInvalidAuthorizationSpecException: Wrong user name or password [28000-214] at org.h2.message.DbException.getJdbcSQLException( DbException.java:510 ) ~[h2-2.1.214.jar:2.1.214] at org.h2.engine.SessionRemote.readException( SessionRemote.java:637 ) ~[h2-2.1.214.jar:2.1.214] at org.h2.engine.SessionRemote.done( SessionRemote.java:606 ) ~[h2-2.1.214.jar:2.1.214] at org.h2.engine.SessionRemote.initTransfer( SessionRemote.java:163 ) ~[h2-2.1.214.jar:2.1.214] at org.h2.engine.SessionRemote.connectServer( SessionRemote.java:433 ) ~[h2-2.1.214.jar:2.1.214] at org.h2.engine.SessionRemote.connectEmbeddedOrServer( SessionRemote.java:325 ) ~[h2-2.1.214.jar:2.1.214] at org.h2.jdbc.JdbcConnection.<init>( JdbcConnection.java:122 ) ~[h2-2.1.214.jar:2.1.214] at org.h2.Driver.connect( Driver.java:59 ) ~[h2-2.1.214.jar:2.1.214] at com.zaxxer.hikari.util.DriverDataSource.getConnection( DriverDataSource.java:121 ) ~[HikariCP-4.0.3.jar:na] at com.zaxxer.hikari.pool.PoolBase.newConnection( PoolBase.java:364 ) ~[HikariCP-4.0.3.jar:na] at com.zaxxer.hikari.pool.PoolBase.newPoolEntry( PoolBase.java:206 ) ~[HikariCP-4.0.3.jar:na] at com.zaxxer.hikari.pool.HikariPool.createPoolEntry( HikariPool.java:476 ) ~[HikariCP-4.0.3.jar:na] at com.zaxxer.hikari.pool.HikariPool.checkFailFast( HikariPool.java:561 ) ~[HikariCP-4.0.3.jar:na] at com.zaxxer.hikari.pool.HikariPool.<init>( HikariPool.java:115 ) ~[HikariCP-4.0.3.jar:na] at com.zaxxer.hikari.HikariDataSource.getConnection( HikariDataSource.java:112 ) ~[HikariCP-4.0.3.jar:na] at org.springframework.jdbc.datasource.DataSourceTransactionManager.doBegin( DataSourceTransactionManager.java:265 ) ~[spring-jdbc-5.3.27.jar:5.3.27] at org.springframework.transaction.support .AbstractPlatformTransactionManager.startTransaction( AbstractPlatformTransactionManager.java:400 ) ~[spring-tx-5.3.27.jar:5.3.27] at org.springframework.transaction.support .AbstractPlatformTransactionManager.getTransaction( AbstractPlatformTransactionManager.java:373 ) ~[spring-tx-5.3.27.jar:5.3.27] at org.springframework.test.context.transaction.TransactionContext.startTransaction( TransactionContext.java:103 ) ~[spring-test-5.3.27.jar:5.3.27] at org.springframework.test.context.transaction.TransactionalTestExecutionListener.beforeTestMethod( TransactionalTestExecutionListener.java:231 ) ~[spring-test-5.3.27.jar:5.3.27] at org.springframework.test.context.TestContextManager.beforeTestMethod( TestContextManager.java:293 ) ~[spring-test-5.3.27.jar:5.3.27] at org.springframework.test.context.junit.jupiter.SpringExtension.beforeEach( SpringExtension.java:174 ) ~[spring-test-5.3.27.jar:5.3.27] at org.junit.jupiter.engine.descriptor.TestMethodTestDescriptor.lambda$invokeBeforeEachCallbacks$2( TestMethodTestDescriptor.java:163 ) ~[junit-jupiter-engine-5.8.2.jar:5.8.2] at org.junit.jupiter.engine.descriptor.TestMethodTestDescriptor.lambda$invokeBeforeMethodsOrCallbacksUntilExceptionOccurs$6( TestMethodTestDescriptor.java:199 ) ~[junit-jupiter-engine-5.8.2.jar:5.8.2] at org.junit.platform.engine.support .hierarchical.ThrowableCollector.execute( ThrowableCollector.java:73 ) ~[junit-platform-engine-1.8.2.jar:1.8.2] at org.junit.jupiter.engine.descriptor.TestMethodTestDescriptor.invokeBeforeMethodsOrCallbacksUntilExceptionOccurs( TestMethodTestDescriptor.java:199 ) ~[junit-jupiter-engine-5.8.2.jar:5.8.2] at org.junit.jupiter.engine.descriptor.TestMethodTestDescriptor.invokeBeforeEachCallbacks( TestMethodTestDescriptor.java:162 ) ~[junit-jupiter-engine-5.8.2.jar:5.8.2] at org.junit.jupiter.engine.descriptor.TestMethodTestDescriptor.execute( TestMethodTestDescriptor.java:129 ) ~[junit-jupiter-engine-5.8.2.jar:5.8.2] at org.junit.jupiter.engine.descriptor.TestMethodTestDescriptor.execute( TestMethodTestDescriptor.java:66 ) ~[junit-jupiter-engine-5.8.2.jar:5.8.2] at org.junit.platform.engine.support .hierarchical.NodeTestTask.lambda$executeRecursively$6( NodeTestTask.java:151 ) ~[junit-platform-engine-1.8.2.jar:1.8.2] at org.junit.platform.engine.support .hierarchical.ThrowableCollector.execute( ThrowableCollector.java:73 ) ~[junit-platform-engine-1.8.2.jar:1.8.2] at org.junit.platform.engine.support .hierarchical.NodeTestTask.lambda$executeRecursively$8( NodeTestTask.java:141 ) ~[junit-platform-engine-1.8.2.jar:1.8.2] at org.junit.platform.engine.support .hierarchical.Node.around( Node.java:137 ) ~[junit-platform-engine-1.8.2.jar:1.8.2] at org.junit.platform.engine.support .hierarchical.NodeTestTask.lambda$executeRecursively$9( NodeTestTask.java:139 ) ~[junit-platform-engine-1.8.2.jar:1.8.2] at org.junit.platform.engine.support .hierarchical.ThrowableCollector.execute( ThrowableCollector.java:73 ) ~[junit-platform-engine-1.8.2.jar:1.8.2] at org.junit.platform.engine.support .hierarchical.NodeTestTask.executeRecursively( NodeTestTask.java:138 ) ~[junit-platform-engine-1.8.2.jar:1.8.2] at org.junit.platform.engine.support .hierarchical.NodeTestTask.execute( NodeTestTask.java:95 ) ~[junit-platform-engine-1.8.2.jar:1.8.2] at java.base/java.util.ArrayList.forEach( ArrayList.java:1541 ) ~[na:na] at org.junit.platform.engine.support .hierarchical.SameThreadHierarchicalTestExecutorService.invokeAll( SameThreadHierarchicalTestExecutorService.java:41 ) ~[junit-platform-engine-1.8.2.jar:1.8.2] at org.junit.platform.engine.support .hierarchical.NodeTestTask.lambda$executeRecursively$6( NodeTestTask.java:155 ) ~[junit-platform-engine-1.8.2.jar:1.8.2] at org.junit.platform.engine.support .hierarchical.ThrowableCollector.execute( ThrowableCollector.java:73 ) ~[junit-platform-engine-1.8.2.jar:1.8.2] at org.junit.platform.engine.support .hierarchical.NodeTestTask.lambda$executeRecursively$8( NodeTestTask.java:141 ) ~[junit-platform-engine-1.8.2.jar:1.8.2] at org.junit.platform.engine.support .hierarchical.Node.around( Node.java:137 ) ~[junit-platform-engine-1.8.2.jar:1.8.2] at org.junit.platform.engine.support .hierarchical.NodeTestTask.lambda$executeRecursively$9( NodeTestTask.java:139 ) ~[junit-platform-engine-1.8.2.jar:1.8.2] at org.junit.platform.engine.support .hierarchical.ThrowableCollector.execute( ThrowableCollector.java:73 ) ~[junit-platform-engine-1.8.2.jar:1.8.2] at org.junit.platform.engine.support .hierarchical.NodeTestTask.executeRecursively( NodeTestTask.java:138 ) ~[junit-platform-engine-1.8.2.jar:1.8.2] at org.junit.platform.engine.support .hierarchical.NodeTestTask.execute( NodeTestTask.java:95 ) ~[junit-platform-engine-1.8.2.jar:1.8.2] at java.base/java.util.ArrayList.forEach( ArrayList.java:1541 ) ~[na:na] at org.junit.platform.engine.support .hierarchical.SameThreadHierarchicalTestExecutorService.invokeAll( SameThreadHierarchicalTestExecutorService.java:41 ) ~[junit-platform-engine-1.8.2.jar:1.8.2] at org.junit.platform.engine.support .hierarchical.NodeTestTask.lambda$executeRecursively$6( NodeTestTask.java:155 ) ~[junit-platform-engine-1.8.2.jar:1.8.2] at org.junit.platform.engine.support .hierarchical.ThrowableCollector.execute( ThrowableCollector.java:73 ) ~[junit-platform-engine-1.8.2.jar:1.8.2] at org.junit.platform.engine.support .hierarchical.NodeTestTask.lambda$executeRecursively$8( NodeTestTask.java:141 ) ~[junit-platform-engine-1.8.2.jar:1.8.2] at org.junit.platform.engine.support .hierarchical.Node.around( Node.java:137 ) ~[junit-platform-engine-1.8.2.jar:1.8.2] at org.junit.platform.engine.support .hierarchical.NodeTestTask.lambda$executeRecursively$9( NodeTestTask.java:139 ) ~[junit-platform-engine-1.8.2.jar:1.8.2] at org.junit.platform.engine.support .hierarchical.ThrowableCollector.execute( ThrowableCollector.java:73 ) ~[junit-platform-engine-1.8.2.jar:1.8.2] at org.junit.platform.engine.support .hierarchical.NodeTestTask.executeRecursively( NodeTestTask.java:138 ) ~[junit-platform-engine-1.8.2.jar:1.8.2] at org.junit.platform.engine.support .hierarchical.NodeTestTask.execute( NodeTestTask.java:95 ) ~[junit-platform-engine-1.8.2.jar:1.8.2] at org.junit.platform.engine.support .hierarchical.SameThreadHierarchicalTestExecutorService.submit( SameThreadHierarchicalTestExecutorService.java:35 ) ~[junit-platform-engine-1.8.2.jar:1.8.2] at org.junit.platform.engine.support .hierarchical.HierarchicalTestExecutor.execute( HierarchicalTestExecutor.java:57 ) ~[junit-platform-engine-1.8.2.jar:1.8.2] at org.junit.platform.engine.support .hierarchical.HierarchicalTestEngine.execute( HierarchicalTestEngine.java:54 ) ~[junit-platform-engine-1.8.2.jar:1.8.2] at org.junit.platform.launcher.core.EngineExecutionOrchestrator.execute( EngineExecutionOrchestrator.java:107 ) ~[na:na] at org.junit.platform.launcher.core.EngineExecutionOrchestrator.execute( EngineExecutionOrchestrator.java:88 ) ~[na:na] at org.junit.platform.launcher.core.EngineExecutionOrchestrator.lambda$execute$0( EngineExecutionOrchestrator.java:54 ) ~[na:na] at org.junit.platform.launcher.core.EngineExecutionOrchestrator.withInterceptedStreams( EngineExecutionOrchestrator.java:67 ) ~[na:na] at org.junit.platform.launcher.core.EngineExecutionOrchestrator.execute( EngineExecutionOrchestrator.java:52 ) ~[na:na] at org.junit.platform.launcher.core.DefaultLauncher.execute( DefaultLauncher.java:114 ) ~[na:na] at org.junit.platform.launcher.core.DefaultLauncher.execute( DefaultLauncher.java:86 ) ~[na:na] at org.junit.platform.launcher.core.DefaultLauncherSession$DelegatingLauncher.execute( DefaultLauncherSession.java:86 ) ~[na:na] at org.junit.platform.launcher.core.SessionPerRequestLauncher.execute( SessionPerRequestLauncher.java:53 ) ~[na:na] at org.gradle.api.internal.tasks.testing.junitplatform.JUnitPlatformTestClassProcessor$CollectAllTestClassesExecutor.processAllTestClasses( JUnitPlatformTestClassProcessor.java:99 ) ~[na:na] at org.gradle.api.internal.tasks.testing.junitplatform.JUnitPlatformTestClassProcessor$CollectAllTestClassesExecutor.access$000( JUnitPlatformTestClassProcessor.java:79 ) ~[na:na] at org.gradle.api.internal.tasks.testing.junitplatform.JUnitPlatformTestClassProcessor.stop( JUnitPlatformTestClassProcessor.java:75 ) ~[na:na] at org.gradle.api.internal.tasks.testing.SuiteTestClassProcessor.stop( SuiteTestClassProcessor.java:62 ) ~[na:na] at java.base/jdk.internal.reflect.NativeMethodAccessorImpl.invoke0(Native Method) ~[na:na] at java.base/jdk.internal.reflect.NativeMethodAccessorImpl.invoke( NativeMethodAccessorImpl.java:62 ) ~[na:na] at java.base/jdk.internal.reflect.DelegatingMethodAccessorImpl.invoke( DelegatingMethodAccessorImpl.java:43 ) ~[na:na] at java.base/java.lang.reflect.Method.invoke( Method.java:566 ) ~[na:na] at org.gradle.internal.dispatch.ReflectionDispatch.dispatch( ReflectionDispatch.java:36 ) ~[na:na] at org.gradle.internal.dispatch.ReflectionDispatch.dispatch( ReflectionDispatch.java:24 ) ~[na:na] at org.gradle.internal.dispatch.ContextClassLoaderDispatch.dispatch( ContextClassLoaderDispatch.java:33 ) ~[na:na] at org.gradle.internal.dispatch.ProxyDispatchAdapter$DispatchingInvocationHandler.invoke( ProxyDispatchAdapter.java:94 ) ~[na:na] at com.sun.proxy.$Proxy2.stop(Unknown Source) ~[na:na] at org.gradle.api.internal.tasks.testing.worker.TestWorker$3.run( TestWorker.java:193 ) ~[na:na] at org.gradle.api.internal.tasks.testing.worker.TestWorker.executeAndMaintainThreadName( TestWorker.java:129 ) ~[na:na] at org.gradle.api.internal.tasks.testing.worker.TestWorker.execute( TestWorker.java:100 ) ~[na:na] at org.gradle.api.internal.tasks.testing.worker.TestWorker.execute( TestWorker.java:60 ) ~[na:na] at org.gradle.process.internal.worker.child.ActionExecutionWorker.execute( ActionExecutionWorker.java:56 ) ~[na:na] at org.gradle.process.internal.worker.child.SystemApplicationClassLoaderWorker.call ( SystemApplicationClassLoaderWorker.java:113 ) ~[na:na] at org.gradle.process.internal.worker.child.SystemApplicationClassLoaderWorker.call ( SystemApplicationClassLoaderWorker.java:65 ) ~[na:na] at worker.org.gradle.process.internal.worker.GradleWorkerMain.run ( GradleWorkerMain.java:69 ) ~[gradle-worker.jar:na] at worker.org .gradle.process.internal.worker.GradleWorkerMain.main( GradleWorkerMain.java:74 ) ~[gradle-worker.jar:na] 2023-07-04 01:14:37.021 WARN 2132 --- [ Test worker] o.s.test.context.TestContextManager : Caught exception while invoking 'beforeTestMethod' callback on TestExecutionListener [org.springframework.test.context.transaction.TransactionalTestExecutionListener@3c321bdb] for test method [public void hello.hellospring.service.MemberServiceIntegrationTest.중복회원예외()] and test instance [hello.hellospring.service.MemberServiceIntegrationTest@497ed877] org.springframework.transaction.CannotCreateTransactionException: Could not open JDBC Connection for transaction; nested exception is org.h2.jdbc.JdbcSQLInvalidAuthorizationSpecException: Wrong user name or password [28000-214] at org.h2.message.DbException.getJdbcSQLException( DbException.java:510 ) at org.h2.message.DbException.getJdbcSQLException( DbException.java:477 ) at org.h2.message.DbException.get( DbException.java:223 ) at org.h2.message.DbException.get( DbException.java:199 ) at org.h2.message.DbException.get( DbException.java:188 ) at org.h2.engine.Engine.validateUserAndPassword( Engine.java:393 ) at org.h2.engine.Engine.createSession( Engine.java:206 ) at org.h2.server.TcpServerThread.run ( TcpServerThread.java:175 ) at java.base/java.lang.Thread.run( Thread.java:834 ) at org.springframework.jdbc.datasource.DataSourceTransactionManager.doBegin( DataSourceTransactionManager.java:309 ) ~[spring-jdbc-5.3.27.jar:5.3.27] at org.springframework.transaction.support .AbstractPlatformTransactionManager.startTransaction( AbstractPlatformTransactionManager.java:400 ) ~[spring-tx-5.3.27.jar:5.3.27] at org.springframework.transaction.support .AbstractPlatformTransactionManager.getTransaction( AbstractPlatformTransactionManager.java:373 ) ~[spring-tx-5.3.27.jar:5.3.27] at org.springframework.test.context.transaction.TransactionContext.startTransaction( TransactionContext.java:103 ) ~[spring-test-5.3.27.jar:5.3.27] at org.springframework.test.context.transaction.TransactionalTestExecutionListener.beforeTestMethod( TransactionalTestExecutionListener.java:231 ) ~[spring-test-5.3.27.jar:5.3.27] at org.springframework.test.context.TestContextManager.beforeTestMethod( TestContextManager.java:293 ) ~[spring-test-5.3.27.jar:5.3.27] at org.springframework.test.context.junit.jupiter.SpringExtension.beforeEach( SpringExtension.java:174 ) ~[spring-test-5.3.27.jar:5.3.27] at org.junit.jupiter.engine.descriptor.TestMethodTestDescriptor.lambda$invokeBeforeEachCallbacks$2( TestMethodTestDescriptor.java:163 ) ~[junit-jupiter-engine-5.8.2.jar:5.8.2] at org.junit.jupiter.engine.descriptor.TestMethodTestDescriptor.lambda$invokeBeforeMethodsOrCallbacksUntilExceptionOccurs$6( TestMethodTestDescriptor.java:199 ) ~[junit-jupiter-engine-5.8.2.jar:5.8.2] at org.junit.platform.engine.support .hierarchical.ThrowableCollector.execute( ThrowableCollector.java:73 ) ~[junit-platform-engine-1.8.2.jar:1.8.2] at org.junit.jupiter.engine.descriptor.TestMethodTestDescriptor.invokeBeforeMethodsOrCallbacksUntilExceptionOccurs( TestMethodTestDescriptor.java:199 ) ~[junit-jupiter-engine-5.8.2.jar:5.8.2] at org.junit.jupiter.engine.descriptor.TestMethodTestDescriptor.invokeBeforeEachCallbacks( TestMethodTestDescriptor.java:162 ) ~[junit-jupiter-engine-5.8.2.jar:5.8.2] at org.junit.jupiter.engine.descriptor.TestMethodTestDescriptor.execute( TestMethodTestDescriptor.java:129 ) ~[junit-jupiter-engine-5.8.2.jar:5.8.2] at org.junit.jupiter.engine.descriptor.TestMethodTestDescriptor.execute( TestMethodTestDescriptor.java:66 ) ~[junit-jupiter-engine-5.8.2.jar:5.8.2] at org.junit.platform.engine.support .hierarchical.NodeTestTask.lambda$executeRecursively$6( NodeTestTask.java:151 ) ~[junit-platform-engine-1.8.2.jar:1.8.2] at org.junit.platform.engine.support .hierarchical.ThrowableCollector.execute( ThrowableCollector.java:73 ) ~[junit-platform-engine-1.8.2.jar:1.8.2] at org.junit.platform.engine.support .hierarchical.NodeTestTask.lambda$executeRecursively$8( NodeTestTask.java:141 ) ~[junit-platform-engine-1.8.2.jar:1.8.2] at org.junit.platform.engine.support .hierarchical.Node.around( Node.java:137 ) ~[junit-platform-engine-1.8.2.jar:1.8.2] at org.junit.platform.engine.support .hierarchical.NodeTestTask.lambda$executeRecursively$9( NodeTestTask.java:139 ) ~[junit-platform-engine-1.8.2.jar:1.8.2] at org.junit.platform.engine.support .hierarchical.ThrowableCollector.execute( ThrowableCollector.java:73 ) ~[junit-platform-engine-1.8.2.jar:1.8.2] at org.junit.platform.engine.support .hierarchical.NodeTestTask.executeRecursively( NodeTestTask.java:138 ) ~[junit-platform-engine-1.8.2.jar:1.8.2] at org.junit.platform.engine.support .hierarchical.NodeTestTask.execute( NodeTestTask.java:95 ) ~[junit-platform-engine-1.8.2.jar:1.8.2] at java.base/java.util.ArrayList.forEach( ArrayList.java:1541 ) ~[na:na] at org.junit.platform.engine.support .hierarchical.SameThreadHierarchicalTestExecutorService.invokeAll( SameThreadHierarchicalTestExecutorService.java:41 ) ~[junit-platform-engine-1.8.2.jar:1.8.2] at org.junit.platform.engine.support .hierarchical.NodeTestTask.lambda$executeRecursively$6( NodeTestTask.java:155 ) ~[junit-platform-engine-1.8.2.jar:1.8.2] at org.junit.platform.engine.support .hierarchical.ThrowableCollector.execute( ThrowableCollector.java:73 ) ~[junit-platform-engine-1.8.2.jar:1.8.2] at org.junit.platform.engine.support .hierarchical.NodeTestTask.lambda$executeRecursively$8( NodeTestTask.java:141 ) ~[junit-platform-engine-1.8.2.jar:1.8.2] at org.junit.platform.engine.support .hierarchical.Node.around( Node.java:137 ) ~[junit-platform-engine-1.8.2.jar:1.8.2] at org.junit.platform.engine.support .hierarchical.NodeTestTask.lambda$executeRecursively$9( NodeTestTask.java:139 ) ~[junit-platform-engine-1.8.2.jar:1.8.2] at org.junit.platform.engine.support .hierarchical.ThrowableCollector.execute( ThrowableCollector.java:73 ) ~[junit-platform-engine-1.8.2.jar:1.8.2] at org.junit.platform.engine.support .hierarchical.NodeTestTask.executeRecursively( NodeTestTask.java:138 ) ~[junit-platform-engine-1.8.2.jar:1.8.2] at org.junit.platform.engine.support .hierarchical.NodeTestTask.execute( NodeTestTask.java:95 ) ~[junit-platform-engine-1.8.2.jar:1.8.2] at java.base/java.util.ArrayList.forEach( ArrayList.java:1541 ) ~[na:na] at org.junit.platform.engine.support .hierarchical.SameThreadHierarchicalTestExecutorService.invokeAll( SameThreadHierarchicalTestExecutorService.java:41 ) ~[junit-platform-engine-1.8.2.jar:1.8.2] at org.junit.platform.engine.support .hierarchical.NodeTestTask.lambda$executeRecursively$6( NodeTestTask.java:155 ) ~[junit-platform-engine-1.8.2.jar:1.8.2] at org.junit.platform.engine.support .hierarchical.ThrowableCollector.execute( ThrowableCollector.java:73 ) ~[junit-platform-engine-1.8.2.jar:1.8.2] at org.junit.platform.engine.support .hierarchical.NodeTestTask.lambda$executeRecursively$8( NodeTestTask.java:141 ) ~[junit-platform-engine-1.8.2.jar:1.8.2] at org.junit.platform.engine.support .hierarchical.Node.around( Node.java:137 ) ~[junit-platform-engine-1.8.2.jar:1.8.2] at org.junit.platform.engine.support .hierarchical.NodeTestTask.lambda$executeRecursively$9( NodeTestTask.java:139 ) ~[junit-platform-engine-1.8.2.jar:1.8.2] at org.junit.platform.engine.support .hierarchical.ThrowableCollector.execute( ThrowableCollector.java:73 ) ~[junit-platform-engine-1.8.2.jar:1.8.2] at org.junit.platform.engine.support .hierarchical.NodeTestTask.executeRecursively( NodeTestTask.java:138 ) ~[junit-platform-engine-1.8.2.jar:1.8.2] at org.junit.platform.engine.support .hierarchical.NodeTestTask.execute( NodeTestTask.java:95 ) ~[junit-platform-engine-1.8.2.jar:1.8.2] at org.junit.platform.engine.support .hierarchical.SameThreadHierarchicalTestExecutorService.submit( SameThreadHierarchicalTestExecutorService.java:35 ) ~[junit-platform-engine-1.8.2.jar:1.8.2] at org.junit.platform.engine.support .hierarchical.HierarchicalTestExecutor.execute( HierarchicalTestExecutor.java:57 ) ~[junit-platform-engine-1.8.2.jar:1.8.2] at org.junit.platform.engine.support .hierarchical.HierarchicalTestEngine.execute( HierarchicalTestEngine.java:54 ) ~[junit-platform-engine-1.8.2.jar:1.8.2] at org.junit.platform.launcher.core.EngineExecutionOrchestrator.execute( EngineExecutionOrchestrator.java:107 ) ~[na:na] at org.junit.platform.launcher.core.EngineExecutionOrchestrator.execute( EngineExecutionOrchestrator.java:88 ) ~[na:na] at org.junit.platform.launcher.core.EngineExecutionOrchestrator.lambda$execute$0( EngineExecutionOrchestrator.java:54 ) ~[na:na] at org.junit.platform.launcher.core.EngineExecutionOrchestrator.withInterceptedStreams( EngineExecutionOrchestrator.java:67 ) ~[na:na] at org.junit.platform.launcher.core.EngineExecutionOrchestrator.execute( EngineExecutionOrchestrator.java:52 ) ~[na:na] at org.junit.platform.launcher.core.DefaultLauncher.execute( DefaultLauncher.java:114 ) ~[na:na] at org.junit.platform.launcher.core.DefaultLauncher.execute( DefaultLauncher.java:86 ) ~[na:na] at org.junit.platform.launcher.core.DefaultLauncherSession$DelegatingLauncher.execute( DefaultLauncherSession.java:86 ) ~[na:na] at org.junit.platform.launcher.core.SessionPerRequestLauncher.execute( SessionPerRequestLauncher.java:53 ) ~[na:na] at org.gradle.api.internal.tasks.testing.junitplatform.JUnitPlatformTestClassProcessor$CollectAllTestClassesExecutor.processAllTestClasses( JUnitPlatformTestClassProcessor.java:99 ) ~[na:na] at org.gradle.api.internal.tasks.testing.junitplatform.JUnitPlatformTestClassProcessor$CollectAllTestClassesExecutor.access$000( JUnitPlatformTestClassProcessor.java:79 ) ~[na:na] at org.gradle.api.internal.tasks.testing.junitplatform.JUnitPlatformTestClassProcessor.stop( JUnitPlatformTestClassProcessor.java:75 ) ~[na:na] at org.gradle.api.internal.tasks.testing.SuiteTestClassProcessor.stop( SuiteTestClassProcessor.java:62 ) ~[na:na] at java.base/jdk.internal.reflect.NativeMethodAccessorImpl.invoke0(Native Method) ~[na:na] at java.base/jdk.internal.reflect.NativeMethodAccessorImpl.invoke( NativeMethodAccessorImpl.java:62 ) ~[na:na] at java.base/jdk.internal.reflect.DelegatingMethodAccessorImpl.invoke( DelegatingMethodAccessorImpl.java:43 ) ~[na:na] at java.base/java.lang.reflect.Method.invoke( Method.java:566 ) ~[na:na] at org.gradle.internal.dispatch.ReflectionDispatch.dispatch( ReflectionDispatch.java:36 ) ~[na:na] at org.gradle.internal.dispatch.ReflectionDispatch.dispatch( ReflectionDispatch.java:24 ) ~[na:na] at org.gradle.internal.dispatch.ContextClassLoaderDispatch.dispatch( ContextClassLoaderDispatch.java:33 ) ~[na:na] at org.gradle.internal.dispatch.ProxyDispatchAdapter$DispatchingInvocationHandler.invoke( ProxyDispatchAdapter.java:94 ) ~[na:na] at com.sun.proxy.$Proxy2.stop(Unknown Source) ~[na:na] at org.gradle.api.internal.tasks.testing.worker.TestWorker$3.run( TestWorker.java:193 ) ~[na:na] at org.gradle.api.internal.tasks.testing.worker.TestWorker.executeAndMaintainThreadName( TestWorker.java:129 ) ~[na:na] at org.gradle.api.internal.tasks.testing.worker.TestWorker.execute( TestWorker.java:100 ) ~[na:na] at org.gradle.api.internal.tasks.testing.worker.TestWorker.execute( TestWorker.java:60 ) ~[na:na] at org.gradle.process.internal.worker.child.ActionExecutionWorker.execute( ActionExecutionWorker.java:56 ) ~[na:na] at org.gradle.process.internal.worker.child.SystemApplicationClassLoaderWorker.call ( SystemApplicationClassLoaderWorker.java:113 ) ~[na:na] at org.gradle.process.internal.worker.child.SystemApplicationClassLoaderWorker.call ( SystemApplicationClassLoaderWorker.java:65 ) ~[na:na] at worker.org.gradle.process.internal.worker.GradleWorkerMain.run ( GradleWorkerMain.java:69 ) ~[gradle-worker.jar:na] at worker.org .gradle.process.internal.worker.GradleWorkerMain.main( GradleWorkerMain.java:74 ) ~[gradle-worker.jar:na] Caused by: org.h2.jdbc.JdbcSQLInvalidAuthorizationSpecException: Wrong user name or password [28000-214] at org.h2.message.DbException.getJdbcSQLException( DbException.java:510 ) ~[h2-2.1.214.jar:2.1.214] at org.h2.engine.SessionRemote.readException( SessionRemote.java:637 ) ~[h2-2.1.214.jar:2.1.214] at org.h2.engine.SessionRemote.done( SessionRemote.java:606 ) ~[h2-2.1.214.jar:2.1.214] at org.h2.engine.SessionRemote.initTransfer( SessionRemote.java:163 ) ~[h2-2.1.214.jar:2.1.214] at org.h2.engine.SessionRemote.connectServer( SessionRemote.java:433 ) ~[h2-2.1.214.jar:2.1.214] at org.h2.engine.SessionRemote.connectEmbeddedOrServer( SessionRemote.java:325 ) ~[h2-2.1.214.jar:2.1.214] at org.h2.jdbc.JdbcConnection.<init>( JdbcConnection.java:122 ) ~[h2-2.1.214.jar:2.1.214] at org.h2.Driver.connect( Driver.java:59 ) ~[h2-2.1.214.jar:2.1.214] at com.zaxxer.hikari.util.DriverDataSource.getConnection( DriverDataSource.java:121 ) ~[HikariCP-4.0.3.jar:na] at com.zaxxer.hikari.pool.PoolBase.newConnection( PoolBase.java:364 ) ~[HikariCP-4.0.3.jar:na] at com.zaxxer.hikari.pool.PoolBase.newPoolEntry( PoolBase.java:206 ) ~[HikariCP-4.0.3.jar:na] at com.zaxxer.hikari.pool.HikariPool.createPoolEntry( HikariPool.java:476 ) ~[HikariCP-4.0.3.jar:na] at com.zaxxer.hikari.pool.HikariPool.checkFailFast( HikariPool.java:561 ) ~[HikariCP-4.0.3.jar:na] at com.zaxxer.hikari.pool.HikariPool.<init>( HikariPool.java:115 ) ~[HikariCP-4.0.3.jar:na] at com.zaxxer.hikari.HikariDataSource.getConnection( HikariDataSource.java:112 ) ~[HikariCP-4.0.3.jar:na] at org.springframework.jdbc.datasource.DataSourceTransactionManager.doBegin( DataSourceTransactionManager.java:265 ) ~[spring-jdbc-5.3.27.jar:5.3.27] ... 75 common frames omitted Could not open JDBC Connection for transaction; nested exception is org.h2.jdbc.JdbcSQLInvalidAuthorizationSpecException: Wrong user name or password [28000-214] at org.h2.message.DbException.getJdbcSQLException( DbException.java:510 ) at org.h2.message.DbException.getJdbcSQLException( DbException.java:477 ) at org.h2.message.DbException.get( DbException.java:223 ) at org.h2.message.DbException.get( DbException.java:199 ) at org.h2.message.DbException.get( DbException.java:188 ) at org.h2.engine.Engine.validateUserAndPassword( Engine.java:393 ) at org.h2.engine.Engine.createSession( Engine.java:206 ) at org.h2.server.TcpServerThread.run ( TcpServerThread.java:175 ) at java.base/java.lang.Thread.run( Thread.java:834 ) org.springframework.transaction.CannotCreateTransactionException: Could not open JDBC Connection for transaction; nested exception is org.h2.jdbc.JdbcSQLInvalidAuthorizationSpecException: Wrong user name or password [28000-214] at org.h2.message.DbException.getJdbcSQLException( DbException.java:510 ) at org.h2.message.DbException.getJdbcSQLException( DbException.java:477 ) at org.h2.message.DbException.get( DbException.java:223 ) at org.h2.message.DbException.get( DbException.java:199 ) at org.h2.message.DbException.get( DbException.java:188 ) at org.h2.engine.Engine.validateUserAndPassword( Engine.java:393 ) at org.h2.engine.Engine.createSession( Engine.java:206 ) at org.h2.server.TcpServerThread.run ( TcpServerThread.java:175 ) at java.base/java.lang.Thread.run( Thread.java:834 ) at app//org.springframework.jdbc.datasource.DataSourceTransactionManager.doBegin( DataSourceTransactionManager.java:309 ) at app//org.springframework.transaction.support.AbstractPlatformTransactionManager.startTransaction( AbstractPlatformTransactionManager.java:400 ) at app//org.springframework.transaction.support.AbstractPlatformTransactionManager.getTransaction( AbstractPlatformTransactionManager.java:373 ) at app//org.springframework.test.context.transaction.TransactionContext.startTransaction( TransactionContext.java:103 ) at app//org.springframework.test.context.transaction.TransactionalTestExecutionListener.beforeTestMethod( TransactionalTestExecutionListener.java:231 ) at app//org.springframework.test.context.TestContextManager.beforeTestMethod( TestContextManager.java:293 ) at app//org.springframework.test.context.junit.jupiter.SpringExtension.beforeEach( SpringExtension.java:174 ) at app//org.junit.jupiter.engine.descriptor.TestMethodTestDescriptor.lambda$invokeBeforeEachCallbacks$2( TestMethodTestDescriptor.java:163 ) at app//org.junit.jupiter.engine.descriptor.TestMethodTestDescriptor.lambda$invokeBeforeMethodsOrCallbacksUntilExceptionOccurs$6( TestMethodTestDescriptor.java:199 ) at app//org.junit.platform.engine.support.hierarchical.ThrowableCollector.execute( ThrowableCollector.java:73 ) at app//org.junit.jupiter.engine.descriptor.TestMethodTestDescriptor.invokeBeforeMethodsOrCallbacksUntilExceptionOccurs( TestMethodTestDescriptor.java:199 ) at app//org.junit.jupiter.engine.descriptor.TestMethodTestDescriptor.invokeBeforeEachCallbacks( TestMethodTestDescriptor.java:162 ) at app//org.junit.jupiter.engine.descriptor.TestMethodTestDescriptor.execute( TestMethodTestDescriptor.java:129 ) at app//org.junit.jupiter.engine.descriptor.TestMethodTestDescriptor.execute( TestMethodTestDescriptor.java:66 ) at app//org.junit.platform.engine.support.hierarchical.NodeTestTask.lambda$executeRecursively$6( NodeTestTask.java:151 ) at app//org.junit.platform.engine.support.hierarchical.ThrowableCollector.execute( ThrowableCollector.java:73 ) at app//org.junit.platform.engine.support.hierarchical.NodeTestTask.lambda$executeRecursively$8( NodeTestTask.java:141 ) at app//org.junit.platform.engine.support.hierarchical.Node.around( Node.java:137 ) at app//org.junit.platform.engine.support.hierarchical.NodeTestTask.lambda$executeRecursively$9( NodeTestTask.java:139 ) at app//org.junit.platform.engine.support.hierarchical.ThrowableCollector.execute( ThrowableCollector.java:73 ) at app//org.junit.platform.engine.support.hierarchical.NodeTestTask.executeRecursively( NodeTestTask.java:138 ) at app//org.junit.platform.engine.support.hierarchical.NodeTestTask.execute( NodeTestTask.java:95 ) at java.base@11.0.19/java.util.ArrayList.forEach( ArrayList.java:1541 ) at app//org.junit.platform.engine.support.hierarchical.SameThreadHierarchicalTestExecutorService.invokeAll( SameThreadHierarchicalTestExecutorService.java:41 ) at app//org.junit.platform.engine.support.hierarchical.NodeTestTask.lambda$executeRecursively$6( NodeTestTask.java:155 ) at app//org.junit.platform.engine.support.hierarchical.ThrowableCollector.execute( ThrowableCollector.java:73 ) at app//org.junit.platform.engine.support.hierarchical.NodeTestTask.lambda$executeRecursively$8( NodeTestTask.java:141 ) at app//org.junit.platform.engine.support.hierarchical.Node.around( Node.java:137 ) at app//org.junit.platform.engine.support.hierarchical.NodeTestTask.lambda$executeRecursively$9( NodeTestTask.java:139 ) at app//org.junit.platform.engine.support.hierarchical.ThrowableCollector.execute( ThrowableCollector.java:73 ) at app//org.junit.platform.engine.support.hierarchical.NodeTestTask.executeRecursively( NodeTestTask.java:138 ) at app//org.junit.platform.engine.support.hierarchical.NodeTestTask.execute( NodeTestTask.java:95 ) at java.base@11.0.19/java.util.ArrayList.forEach( ArrayList.java:1541 ) at app//org.junit.platform.engine.support.hierarchical.SameThreadHierarchicalTestExecutorService.invokeAll( SameThreadHierarchicalTestExecutorService.java:41 ) at app//org.junit.platform.engine.support.hierarchical.NodeTestTask.lambda$executeRecursively$6( NodeTestTask.java:155 ) at app//org.junit.platform.engine.support.hierarchical.ThrowableCollector.execute( ThrowableCollector.java:73 ) at app//org.junit.platform.engine.support.hierarchical.NodeTestTask.lambda$executeRecursively$8( NodeTestTask.java:141 ) at app//org.junit.platform.engine.support.hierarchical.Node.around( Node.java:137 ) at app//org.junit.platform.engine.support.hierarchical.NodeTestTask.lambda$executeRecursively$9( NodeTestTask.java:139 ) at app//org.junit.platform.engine.support.hierarchical.ThrowableCollector.execute( ThrowableCollector.java:73 ) at app//org.junit.platform.engine.support.hierarchical.NodeTestTask.executeRecursively( NodeTestTask.java:138 ) at app//org.junit.platform.engine.support.hierarchical.NodeTestTask.execute( NodeTestTask.java:95 ) at app//org.junit.platform.engine.support.hierarchical.SameThreadHierarchicalTestExecutorService.submit( SameThreadHierarchicalTestExecutorService.java:35 ) at app//org.junit.platform.engine.support.hierarchical.HierarchicalTestExecutor.execute( HierarchicalTestExecutor.java:57 ) at app//org.junit.platform.engine.support.hierarchical.HierarchicalTestEngine.execute( HierarchicalTestEngine.java:54 ) at org.junit.platform.launcher.core.EngineExecutionOrchestrator.execute( EngineExecutionOrchestrator.java:107 ) at org.junit.platform.launcher.core.EngineExecutionOrchestrator.execute( EngineExecutionOrchestrator.java:88 ) at org.junit.platform.launcher.core.EngineExecutionOrchestrator.lambda$execute$0( EngineExecutionOrchestrator.java:54 ) at org.junit.platform.launcher.core.EngineExecutionOrchestrator.withInterceptedStreams( EngineExecutionOrchestrator.java:67 ) at org.junit.platform.launcher.core.EngineExecutionOrchestrator.execute( EngineExecutionOrchestrator.java:52 ) at org.junit.platform.launcher.core.DefaultLauncher.execute( DefaultLauncher.java:114 ) at org.junit.platform.launcher.core.DefaultLauncher.execute( DefaultLauncher.java:86 ) at org.junit.platform.launcher.core.DefaultLauncherSession$DelegatingLauncher.execute( DefaultLauncherSession.java:86 ) at org.junit.platform.launcher.core.SessionPerRequestLauncher.execute( SessionPerRequestLauncher.java:53 ) at org.gradle.api.internal.tasks.testing.junitplatform.JUnitPlatformTestClassProcessor$CollectAllTestClassesExecutor.processAllTestClasses( JUnitPlatformTestClassProcessor.java:99 ) at org.gradle.api.internal.tasks.testing.junitplatform.JUnitPlatformTestClassProcessor$CollectAllTestClassesExecutor.access$000( JUnitPlatformTestClassProcessor.java:79 ) at org.gradle.api.internal.tasks.testing.junitplatform.JUnitPlatformTestClassProcessor.stop( JUnitPlatformTestClassProcessor.java:75 ) at org.gradle.api.internal.tasks.testing.SuiteTestClassProcessor.stop( SuiteTestClassProcessor.java:62 ) at java.base@11.0.19/jdk.internal.reflect.NativeMethodAccessorImpl.invoke0(Native Method) at java.base@11.0.19/jdk.internal.reflect.NativeMethodAccessorImpl.invoke( NativeMethodAccessorImpl.java:62 ) at java.base@11.0.19/jdk.internal.reflect.DelegatingMethodAccessorImpl.invoke( DelegatingMethodAccessorImpl.java:43 ) at java.base@11.0.19/java.lang.reflect.Method.invoke( Method.java:566 ) at org.gradle.internal.dispatch.ReflectionDispatch.dispatch( ReflectionDispatch.java:36 ) at org.gradle.internal.dispatch.ReflectionDispatch.dispatch( ReflectionDispatch.java:24 ) at org.gradle.internal.dispatch.ContextClassLoaderDispatch.dispatch( ContextClassLoaderDispatch.java:33 ) at org.gradle.internal.dispatch.ProxyDispatchAdapter$DispatchingInvocationHandler.invoke( ProxyDispatchAdapter.java:94 ) at com.sun.proxy.$Proxy2.stop(Unknown Source) at org.gradle.api.internal.tasks.testing.worker.TestWorker$3.run( TestWorker.java:193 ) at org.gradle.api.internal.tasks.testing.worker.TestWorker.executeAndMaintainThreadName( TestWorker.java:129 ) at org.gradle.api.internal.tasks.testing.worker.TestWorker.execute( TestWorker.java:100 ) at org.gradle.api.internal.tasks.testing.worker.TestWorker.execute( TestWorker.java:60 ) at org.gradle.process.internal.worker.child.ActionExecutionWorker.execute( ActionExecutionWorker.java:56 ) at org.gradle.process.internal.worker.child.SystemApplicationClassLoaderWorker.call ( SystemApplicationClassLoaderWorker.java:113 ) at org.gradle.process.internal.worker.child.SystemApplicationClassLoaderWorker.call ( SystemApplicationClassLoaderWorker.java:65 ) at app//worker.org.gradle.process.internal.worker.GradleWorkerMain.run( GradleWorkerMain.java:69 ) at app//worker.org.gradle.process.internal.worker.GradleWorkerMain.main( GradleWorkerMain.java:74 ) Caused by: org.h2.jdbc.JdbcSQLInvalidAuthorizationSpecException: Wrong user name or password [28000-214] at org.h2.message.DbException.getJdbcSQLException( DbException.java:510 ) at org.h2.message.DbException.getJdbcSQLException( DbException.java:477 ) at org.h2.message.DbException.get( DbException.java:223 ) at org.h2.message.DbException.get( DbException.java:199 ) at org.h2.message.DbException.get( DbException.java:188 ) at org.h2.engine.Engine.validateUserAndPassword( Engine.java:393 ) at org.h2.engine.Engine.createSession( Engine.java:206 ) at org.h2.server.TcpServerThread.run ( TcpServerThread.java:175 ) at java.base/java.lang.Thread.run( Thread.java:834 ) at app//org.h2.message.DbException.getJdbcSQLException( DbException.java:510 ) at app//org.h2.engine.SessionRemote.readException( SessionRemote.java:637 ) at app//org.h2.engine.SessionRemote.done( SessionRemote.java:606 ) at app//org.h2.engine.SessionRemote.initTransfer( SessionRemote.java:163 ) at app//org.h2.engine.SessionRemote.connectServer( SessionRemote.java:433 ) at app//org.h2.engine.SessionRemote.connectEmbeddedOrServer( SessionRemote.java:325 ) at app//org.h2.jdbc.JdbcConnection.<init>( JdbcConnection.java:122 ) at app//org.h2.Driver.connect( Driver.java:59 ) at app//com.zaxxer.hikari.util.DriverDataSource.getConnection( DriverDataSource.java:121 ) at app//com.zaxxer.hikari.pool.PoolBase.newConnection( PoolBase.java:364 ) at app//com.zaxxer.hikari.pool.PoolBase.newPoolEntry( PoolBase.java:206 ) at app//com.zaxxer.hikari.pool.HikariPool.createPoolEntry( HikariPool.java:476 ) at app//com.zaxxer.hikari.pool.HikariPool.checkFailFast( HikariPool.java:561 ) at app//com.zaxxer.hikari.pool.HikariPool.<init>( HikariPool.java:115 ) at app//com.zaxxer.hikari.HikariDataSource.getConnection( HikariDataSource.java:112 ) at app//org.springframework.jdbc.datasource.DataSourceTransactionManager.doBegin( DataSourceTransactionManager.java:265 ) ... 75 more 2023-07-04 01:14:37.518 INFO 2132 --- [ Test worker] com.zaxxer.hikari.HikariDataSource : HikariPool-1 - Starting... 2023-07-04 01:14:42.591 ERROR 2132 --- [ Test worker] com.zaxxer.hikari.pool.HikariPool : HikariPool-1 - Exception during pool initialization. org.h2.jdbc.JdbcSQLInvalidAuthorizationSpecException: Wrong user name or password [28000-214] at org.h2.message.DbException.getJdbcSQLException( DbException.java:510 ) ~[h2-2.1.214.jar:2.1.214] at org.h2.engine.SessionRemote.readException( SessionRemote.java:637 ) ~[h2-2.1.214.jar:2.1.214] at org.h2.engine.SessionRemote.done( SessionRemote.java:606 ) ~[h2-2.1.214.jar:2.1.214] at org.h2.engine.SessionRemote.initTransfer( SessionRemote.java:163 ) ~[h2-2.1.214.jar:2.1.214] at org.h2.engine.SessionRemote.connectServer( SessionRemote.java:433 ) ~[h2-2.1.214.jar:2.1.214] at org.h2.engine.SessionRemote.connectEmbeddedOrServer( SessionRemote.java:325 ) ~[h2-2.1.214.jar:2.1.214] at org.h2.jdbc.JdbcConnection.<init>( JdbcConnection.java:122 ) ~[h2-2.1.214.jar:2.1.214] at org.h2.Driver.connect( Driver.java:59 ) ~[h2-2.1.214.jar:2.1.214] at com.zaxxer.hikari.util.DriverDataSource.getConnection( DriverDataSource.java:121 ) ~[HikariCP-4.0.3.jar:na] at com.zaxxer.hikari.pool.PoolBase.newConnection( PoolBase.java:364 ) ~[HikariCP-4.0.3.jar:na] at com.zaxxer.hikari.pool.PoolBase.newPoolEntry( PoolBase.java:206 ) ~[HikariCP-4.0.3.jar:na] at com.zaxxer.hikari.pool.HikariPool.createPoolEntry( HikariPool.java:476 ) ~[HikariCP-4.0.3.jar:na] at com.zaxxer.hikari.pool.HikariPool.checkFailFast( HikariPool.java:561 ) ~[HikariCP-4.0.3.jar:na] at com.zaxxer.hikari.pool.HikariPool.<init>( HikariPool.java:115 ) ~[HikariCP-4.0.3.jar:na] at com.zaxxer.hikari.HikariDataSource.getConnection( HikariDataSource.java:112 ) ~[HikariCP-4.0.3.jar:na] at org.springframework.jdbc.datasource.DataSourceTransactionManager.doBegin( DataSourceTransactionManager.java:265 ) ~[spring-jdbc-5.3.27.jar:5.3.27] at org.springframework.transaction.support .AbstractPlatformTransactionManager.startTransaction( AbstractPlatformTransactionManager.java:400 ) ~[spring-tx-5.3.27.jar:5.3.27] at org.springframework.transaction.support .AbstractPlatformTransactionManager.getTransaction( AbstractPlatformTransactionManager.java:373 ) ~[spring-tx-5.3.27.jar:5.3.27] at org.springframework.test.context.transaction.TransactionContext.startTransaction( TransactionContext.java:103 ) ~[spring-test-5.3.27.jar:5.3.27] at org.springframework.test.context.transaction.TransactionalTestExecutionListener.beforeTestMethod( TransactionalTestExecutionListener.java:231 ) ~[spring-test-5.3.27.jar:5.3.27] at org.springframework.test.context.TestContextManager.beforeTestMethod( TestContextManager.java:293 ) ~[spring-test-5.3.27.jar:5.3.27] at org.springframework.test.context.junit.jupiter.SpringExtension.beforeEach( SpringExtension.java:174 ) ~[spring-test-5.3.27.jar:5.3.27] at org.junit.jupiter.engine.descriptor.TestMethodTestDescriptor.lambda$invokeBeforeEachCallbacks$2( TestMethodTestDescriptor.java:163 ) ~[junit-jupiter-engine-5.8.2.jar:5.8.2] at org.junit.jupiter.engine.descriptor.TestMethodTestDescriptor.lambda$invokeBeforeMethodsOrCallbacksUntilExceptionOccurs$6( TestMethodTestDescriptor.java:199 ) ~[junit-jupiter-engine-5.8.2.jar:5.8.2] at org.junit.platform.engine.support .hierarchical.ThrowableCollector.execute( ThrowableCollector.java:73 ) ~[junit-platform-engine-1.8.2.jar:1.8.2] at org.junit.jupiter.engine.descriptor.TestMethodTestDescriptor.invokeBeforeMethodsOrCallbacksUntilExceptionOccurs( TestMethodTestDescriptor.java:199 ) ~[junit-jupiter-engine-5.8.2.jar:5.8.2] at org.junit.jupiter.engine.descriptor.TestMethodTestDescriptor.invokeBeforeEachCallbacks( TestMethodTestDescriptor.java:162 ) ~[junit-jupiter-engine-5.8.2.jar:5.8.2] at org.junit.jupiter.engine.descriptor.TestMethodTestDescriptor.execute( TestMethodTestDescriptor.java:129 ) ~[junit-jupiter-engine-5.8.2.jar:5.8.2] at org.junit.jupiter.engine.descriptor.TestMethodTestDescriptor.execute( TestMethodTestDescriptor.java:66 ) ~[junit-jupiter-engine-5.8.2.jar:5.8.2] at org.junit.platform.engine.support .hierarchical.NodeTestTask.lambda$executeRecursively$6( NodeTestTask.java:151 ) ~[junit-platform-engine-1.8.2.jar:1.8.2] at org.junit.platform.engine.support .hierarchical.ThrowableCollector.execute( ThrowableCollector.java:73 ) ~[junit-platform-engine-1.8.2.jar:1.8.2] at org.junit.platform.engine.support .hierarchical.NodeTestTask.lambda$executeRecursively$8( NodeTestTask.java:141 ) ~[junit-platform-engine-1.8.2.jar:1.8.2] at org.junit.platform.engine.support .hierarchical.Node.around( Node.java:137 ) ~[junit-platform-engine-1.8.2.jar:1.8.2] at org.junit.platform.engine.support .hierarchical.NodeTestTask.lambda$executeRecursively$9( NodeTestTask.java:139 ) ~[junit-platform-engine-1.8.2.jar:1.8.2] at org.junit.platform.engine.support .hierarchical.ThrowableCollector.execute( ThrowableCollector.java:73 ) ~[junit-platform-engine-1.8.2.jar:1.8.2] at org.junit.platform.engine.support .hierarchical.NodeTestTask.executeRecursively( NodeTestTask.java:138 ) ~[junit-platform-engine-1.8.2.jar:1.8.2] at org.junit.platform.engine.support .hierarchical.NodeTestTask.execute( NodeTestTask.java:95 ) ~[junit-platform-engine-1.8.2.jar:1.8.2] at java.base/java.util.ArrayList.forEach( ArrayList.java:1541 ) ~[na:na] at org.junit.platform.engine.support .hierarchical.SameThreadHierarchicalTestExecutorService.invokeAll( SameThreadHierarchicalTestExecutorService.java:41 ) ~[junit-platform-engine-1.8.2.jar:1.8.2] at org.junit.platform.engine.support .hierarchical.NodeTestTask.lambda$executeRecursively$6( NodeTestTask.java:155 ) ~[junit-platform-engine-1.8.2.jar:1.8.2] at org.junit.platform.engine.support .hierarchical.ThrowableCollector.execute( ThrowableCollector.java:73 ) ~[junit-platform-engine-1.8.2.jar:1.8.2] at org.junit.platform.engine.support .hierarchical.NodeTestTask.lambda$executeRecursively$8( NodeTestTask.java:141 ) ~[junit-platform-engine-1.8.2.jar:1.8.2] at org.junit.platform.engine.support .hierarchical.Node.around( Node.java:137 ) ~[junit-platform-engine-1.8.2.jar:1.8.2] at org.junit.platform.engine.support .hierarchical.NodeTestTask.lambda$executeRecursively$9( NodeTestTask.java:139 ) ~[junit-platform-engine-1.8.2.jar:1.8.2] at org.junit.platform.engine.support .hierarchical.ThrowableCollector.execute( ThrowableCollector.java:73 ) ~[junit-platform-engine-1.8.2.jar:1.8.2] at org.junit.platform.engine.support .hierarchical.NodeTestTask.executeRecursively( NodeTestTask.java:138 ) ~[junit-platform-engine-1.8.2.jar:1.8.2] at org.junit.platform.engine.support .hierarchical.NodeTestTask.execute( NodeTestTask.java:95 ) ~[junit-platform-engine-1.8.2.jar:1.8.2] at java.base/java.util.ArrayList.forEach( ArrayList.java:1541 ) ~[na:na] at org.junit.platform.engine.support .hierarchical.SameThreadHierarchicalTestExecutorService.invokeAll( SameThreadHierarchicalTestExecutorService.java:41 ) ~[junit-platform-engine-1.8.2.jar:1.8.2] at org.junit.platform.engine.support .hierarchical.NodeTestTask.lambda$executeRecursively$6( NodeTestTask.java:155 ) ~[junit-platform-engine-1.8.2.jar:1.8.2] at org.junit.platform.engine.support .hierarchical.ThrowableCollector.execute( ThrowableCollector.java:73 ) ~[junit-platform-engine-1.8.2.jar:1.8.2] at org.junit.platform.engine.support .hierarchical.NodeTestTask.lambda$executeRecursively$8( NodeTestTask.java:141 ) ~[junit-platform-engine-1.8.2.jar:1.8.2] at org.junit.platform.engine.support .hierarchical.Node.around( Node.java:137 ) ~[junit-platform-engine-1.8.2.jar:1.8.2] at org.junit.platform.engine.support .hierarchical.NodeTestTask.lambda$executeRecursively$9( NodeTestTask.java:139 ) ~[junit-platform-engine-1.8.2.jar:1.8.2] at org.junit.platform.engine.support .hierarchical.ThrowableCollector.execute( ThrowableCollector.java:73 ) ~[junit-platform-engine-1.8.2.jar:1.8.2] at org.junit.platform.engine.support .hierarchical.NodeTestTask.executeRecursively( NodeTestTask.java:138 ) ~[junit-platform-engine-1.8.2.jar:1.8.2] at org.junit.platform.engine.support .hierarchical.NodeTestTask.execute( NodeTestTask.java:95 ) ~[junit-platform-engine-1.8.2.jar:1.8.2] at org.junit.platform.engine.support .hierarchical.SameThreadHierarchicalTestExecutorService.submit( SameThreadHierarchicalTestExecutorService.java:35 ) ~[junit-platform-engine-1.8.2.jar:1.8.2] at org.junit.platform.engine.support .hierarchical.HierarchicalTestExecutor.execute( HierarchicalTestExecutor.java:57 ) ~[junit-platform-engine-1.8.2.jar:1.8.2] at org.junit.platform.engine.support .hierarchical.HierarchicalTestEngine.execute( HierarchicalTestEngine.java:54 ) ~[junit-platform-engine-1.8.2.jar:1.8.2] at org.junit.platform.launcher.core.EngineExecutionOrchestrator.execute( EngineExecutionOrchestrator.java:107 ) ~[na:na] at org.junit.platform.launcher.core.EngineExecutionOrchestrator.execute( EngineExecutionOrchestrator.java:88 ) ~[na:na] at org.junit.platform.launcher.core.EngineExecutionOrchestrator.lambda$execute$0( EngineExecutionOrchestrator.java:54 ) ~[na:na] at org.junit.platform.launcher.core.EngineExecutionOrchestrator.withInterceptedStreams( EngineExecutionOrchestrator.java:67 ) ~[na:na] at org.junit.platform.launcher.core.EngineExecutionOrchestrator.execute( EngineExecutionOrchestrator.java:52 ) ~[na:na] at org.junit.platform.launcher.core.DefaultLauncher.execute( DefaultLauncher.java:114 ) ~[na:na] at org.junit.platform.launcher.core.DefaultLauncher.execute( DefaultLauncher.java:86 ) ~[na:na] at org.junit.platform.launcher.core.DefaultLauncherSession$DelegatingLauncher.execute( DefaultLauncherSession.java:86 ) ~[na:na] at org.junit.platform.launcher.core.SessionPerRequestLauncher.execute( SessionPerRequestLauncher.java:53 ) ~[na:na] at org.gradle.api.internal.tasks.testing.junitplatform.JUnitPlatformTestClassProcessor$CollectAllTestClassesExecutor.processAllTestClasses( JUnitPlatformTestClassProcessor.java:99 ) ~[na:na] at org.gradle.api.internal.tasks.testing.junitplatform.JUnitPlatformTestClassProcessor$CollectAllTestClassesExecutor.access$000( JUnitPlatformTestClassProcessor.java:79 ) ~[na:na] at org.gradle.api.internal.tasks.testing.junitplatform.JUnitPlatformTestClassProcessor.stop( JUnitPlatformTestClassProcessor.java:75 ) ~[na:na] at org.gradle.api.internal.tasks.testing.SuiteTestClassProcessor.stop( SuiteTestClassProcessor.java:62 ) ~[na:na] at java.base/jdk.internal.reflect.NativeMethodAccessorImpl.invoke0(Native Method) ~[na:na] at java.base/jdk.internal.reflect.NativeMethodAccessorImpl.invoke( NativeMethodAccessorImpl.java:62 ) ~[na:na] at java.base/jdk.internal.reflect.DelegatingMethodAccessorImpl.invoke( DelegatingMethodAccessorImpl.java:43 ) ~[na:na] at java.base/java.lang.reflect.Method.invoke( Method.java:566 ) ~[na:na] at org.gradle.internal.dispatch.ReflectionDispatch.dispatch( ReflectionDispatch.java:36 ) ~[na:na] at org.gradle.internal.dispatch.ReflectionDispatch.dispatch( ReflectionDispatch.java:24 ) ~[na:na] at org.gradle.internal.dispatch.ContextClassLoaderDispatch.dispatch( ContextClassLoaderDispatch.java:33 ) ~[na:na] at org.gradle.internal.dispatch.ProxyDispatchAdapter$DispatchingInvocationHandler.invoke( ProxyDispatchAdapter.java:94 ) ~[na:na] at com.sun.proxy.$Proxy2.stop(Unknown Source) ~[na:na] at org.gradle.api.internal.tasks.testing.worker.TestWorker$3.run( TestWorker.java:193 ) ~[na:na] at org.gradle.api.internal.tasks.testing.worker.TestWorker.executeAndMaintainThreadName( TestWorker.java:129 ) ~[na:na] at org.gradle.api.internal.tasks.testing.worker.TestWorker.execute( TestWorker.java:100 ) ~[na:na] at org.gradle.api.internal.tasks.testing.worker.TestWorker.execute( TestWorker.java:60 ) ~[na:na] at org.gradle.process.internal.worker.child.ActionExecutionWorker.execute( ActionExecutionWorker.java:56 ) ~[na:na] at org.gradle.process.internal.worker.child.SystemApplicationClassLoaderWorker.call ( SystemApplicationClassLoaderWorker.java:113 ) ~[na:na] at org.gradle.process.internal.worker.child.SystemApplicationClassLoaderWorker.call ( SystemApplicationClassLoaderWorker.java:65 ) ~[na:na] at worker.org.gradle.process.internal.worker.GradleWorkerMain.run ( GradleWorkerMain.java:69 ) ~[gradle-worker.jar:na] at worker.org .gradle.process.internal.worker.GradleWorkerMain.main( GradleWorkerMain.java:74 ) ~[gradle-worker.jar:na] 2023-07-04 01:14:42.609 WARN 2132 --- [ Test worker] o.s.test.context.TestContextManager : Caught exception while invoking 'beforeTestMethod' callback on TestExecutionListener [org.springframework.test.context.transaction.TransactionalTestExecutionListener@3c321bdb] for test method [void hello.hellospring.service.MemberServiceIntegrationTest.join()] and test instance [hello.hellospring.service.MemberServiceIntegrationTest@696174d3] org.springframework.transaction.CannotCreateTransactionException: Could not open JDBC Connection for transaction; nested exception is org.h2.jdbc.JdbcSQLInvalidAuthorizationSpecException: Wrong user name or password [28000-214] at org.h2.message.DbException.getJdbcSQLException( DbException.java:510 ) at org.h2.message.DbException.getJdbcSQLException( DbException.java:477 ) at org.h2.message.DbException.get( DbException.java:223 ) at org.h2.message.DbException.get( DbException.java:199 ) at org.h2.message.DbException.get( DbException.java:188 ) at org.h2.engine.Engine.validateUserAndPassword( Engine.java:393 ) at org.h2.engine.Engine.createSession( Engine.java:206 ) at org.h2.server.TcpServerThread.run ( TcpServerThread.java:175 ) at java.base/java.lang.Thread.run( Thread.java:834 ) at org.springframework.jdbc.datasource.DataSourceTransactionManager.doBegin( DataSourceTransactionManager.java:309 ) ~[spring-jdbc-5.3.27.jar:5.3.27] at org.springframework.transaction.support .AbstractPlatformTransactionManager.startTransaction( AbstractPlatformTransactionManager.java:400 ) ~[spring-tx-5.3.27.jar:5.3.27] at org.springframework.transaction.support .AbstractPlatformTransactionManager.getTransaction( AbstractPlatformTransactionManager.java:373 ) ~[spring-tx-5.3.27.jar:5.3.27] at org.springframework.test.context.transaction.TransactionContext.startTransaction( TransactionContext.java:103 ) ~[spring-test-5.3.27.jar:5.3.27] at org.springframework.test.context.transaction.TransactionalTestExecutionListener.beforeTestMethod( TransactionalTestExecutionListener.java:231 ) ~[spring-test-5.3.27.jar:5.3.27] at org.springframework.test.context.TestContextManager.beforeTestMethod( TestContextManager.java:293 ) ~[spring-test-5.3.27.jar:5.3.27] at org.springframework.test.context.junit.jupiter.SpringExtension.beforeEach( SpringExtension.java:174 ) ~[spring-test-5.3.27.jar:5.3.27] at org.junit.jupiter.engine.descriptor.TestMethodTestDescriptor.lambda$invokeBeforeEachCallbacks$2( TestMethodTestDescriptor.java:163 ) ~[junit-jupiter-engine-5.8.2.jar:5.8.2] at org.junit.jupiter.engine.descriptor.TestMethodTestDescriptor.lambda$invokeBeforeMethodsOrCallbacksUntilExceptionOccurs$6( TestMethodTestDescriptor.java:199 ) ~[junit-jupiter-engine-5.8.2.jar:5.8.2] at org.junit.platform.engine.support .hierarchical.ThrowableCollector.execute( ThrowableCollector.java:73 ) ~[junit-platform-engine-1.8.2.jar:1.8.2] at org.junit.jupiter.engine.descriptor.TestMethodTestDescriptor.invokeBeforeMethodsOrCallbacksUntilExceptionOccurs( TestMethodTestDescriptor.java:199 ) ~[junit-jupiter-engine-5.8.2.jar:5.8.2] at org.junit.jupiter.engine.descriptor.TestMethodTestDescriptor.invokeBeforeEachCallbacks( TestMethodTestDescriptor.java:162 ) ~[junit-jupiter-engine-5.8.2.jar:5.8.2] at org.junit.jupiter.engine.descriptor.TestMethodTestDescriptor.execute( TestMethodTestDescriptor.java:129 ) ~[junit-jupiter-engine-5.8.2.jar:5.8.2] at org.junit.jupiter.engine.descriptor.TestMethodTestDescriptor.execute( TestMethodTestDescriptor.java:66 ) ~[junit-jupiter-engine-5.8.2.jar:5.8.2] at org.junit.platform.engine.support .hierarchical.NodeTestTask.lambda$executeRecursively$6( NodeTestTask.java:151 ) ~[junit-platform-engine-1.8.2.jar:1.8.2] at org.junit.platform.engine.support .hierarchical.ThrowableCollector.execute( ThrowableCollector.java:73 ) ~[junit-platform-engine-1.8.2.jar:1.8.2] at org.junit.platform.engine.support .hierarchical.NodeTestTask.lambda$executeRecursively$8( NodeTestTask.java:141 ) ~[junit-platform-engine-1.8.2.jar:1.8.2] at org.junit.platform.engine.support .hierarchical.Node.around( Node.java:137 ) ~[junit-platform-engine-1.8.2.jar:1.8.2] at org.junit.platform.engine.support .hierarchical.NodeTestTask.lambda$executeRecursively$9( NodeTestTask.java:139 ) ~[junit-platform-engine-1.8.2.jar:1.8.2] at org.junit.platform.engine.support .hierarchical.ThrowableCollector.execute( ThrowableCollector.java:73 ) ~[junit-platform-engine-1.8.2.jar:1.8.2] at org.junit.platform.engine.support .hierarchical.NodeTestTask.executeRecursively( NodeTestTask.java:138 ) ~[junit-platform-engine-1.8.2.jar:1.8.2] at org.junit.platform.engine.support .hierarchical.NodeTestTask.execute( NodeTestTask.java:95 ) ~[junit-platform-engine-1.8.2.jar:1.8.2] at java.base/java.util.ArrayList.forEach( ArrayList.java:1541 ) ~[na:na] at org.junit.platform.engine.support .hierarchical.SameThreadHierarchicalTestExecutorService.invokeAll( SameThreadHierarchicalTestExecutorService.java:41 ) ~[junit-platform-engine-1.8.2.jar:1.8.2] at org.junit.platform.engine.support .hierarchical.NodeTestTask.lambda$executeRecursively$6( NodeTestTask.java:155 ) ~[junit-platform-engine-1.8.2.jar:1.8.2] at org.junit.platform.engine.support .hierarchical.ThrowableCollector.execute( ThrowableCollector.java:73 ) ~[junit-platform-engine-1.8.2.jar:1.8.2] at org.junit.platform.engine.support .hierarchical.NodeTestTask.lambda$executeRecursively$8( NodeTestTask.java:141 ) ~[junit-platform-engine-1.8.2.jar:1.8.2] at org.junit.platform.engine.support .hierarchical.Node.around( Node.java:137 ) ~[junit-platform-engine-1.8.2.jar:1.8.2] at org.junit.platform.engine.support .hierarchical.NodeTestTask.lambda$executeRecursively$9( NodeTestTask.java:139 ) ~[junit-platform-engine-1.8.2.jar:1.8.2] at org.junit.platform.engine.support .hierarchical.ThrowableCollector.execute( ThrowableCollector.java:73 ) ~[junit-platform-engine-1.8.2.jar:1.8.2] at org.junit.platform.engine.support .hierarchical.NodeTestTask.executeRecursively( NodeTestTask.java:138 ) ~[junit-platform-engine-1.8.2.jar:1.8.2] at org.junit.platform.engine.support .hierarchical.NodeTestTask.execute( NodeTestTask.java:95 ) ~[junit-platform-engine-1.8.2.jar:1.8.2] at java.base/java.util.ArrayList.forEach( ArrayList.java:1541 ) ~[na:na] at org.junit.platform.engine.support .hierarchical.SameThreadHierarchicalTestExecutorService.invokeAll( SameThreadHierarchicalTestExecutorService.java:41 ) ~[junit-platform-engine-1.8.2.jar:1.8.2] at org.junit.platform.engine.support .hierarchical.NodeTestTask.lambda$executeRecursively$6( NodeTestTask.java:155 ) ~[junit-platform-engine-1.8.2.jar:1.8.2] at org.junit.platform.engine.support .hierarchical.ThrowableCollector.execute( ThrowableCollector.java:73 ) ~[junit-platform-engine-1.8.2.jar:1.8.2] at org.junit.platform.engine.support .hierarchical.NodeTestTask.lambda$executeRecursively$8( NodeTestTask.java:141 ) ~[junit-platform-engine-1.8.2.jar:1.8.2] at org.junit.platform.engine.support .hierarchical.Node.around( Node.java:137 ) ~[junit-platform-engine-1.8.2.jar:1.8.2] at org.junit.platform.engine.support .hierarchical.NodeTestTask.lambda$executeRecursively$9( NodeTestTask.java:139 ) ~[junit-platform-engine-1.8.2.jar:1.8.2] at org.junit.platform.engine.support .hierarchical.ThrowableCollector.execute( ThrowableCollector.java:73 ) ~[junit-platform-engine-1.8.2.jar:1.8.2] at org.junit.platform.engine.support .hierarchical.NodeTestTask.executeRecursively( NodeTestTask.java:138 ) ~[junit-platform-engine-1.8.2.jar:1.8.2] at org.junit.platform.engine.support .hierarchical.NodeTestTask.execute( NodeTestTask.java:95 ) ~[junit-platform-engine-1.8.2.jar:1.8.2] at org.junit.platform.engine.support .hierarchical.SameThreadHierarchicalTestExecutorService.submit( SameThreadHierarchicalTestExecutorService.java:35 ) ~[junit-platform-engine-1.8.2.jar:1.8.2] at org.junit.platform.engine.support .hierarchical.HierarchicalTestExecutor.execute( HierarchicalTestExecutor.java:57 ) ~[junit-platform-engine-1.8.2.jar:1.8.2] at org.junit.platform.engine.support .hierarchical.HierarchicalTestEngine.execute( HierarchicalTestEngine.java:54 ) ~[junit-platform-engine-1.8.2.jar:1.8.2] at org.junit.platform.launcher.core.EngineExecutionOrchestrator.execute( EngineExecutionOrchestrator.java:107 ) ~[na:na] at org.junit.platform.launcher.core.EngineExecutionOrchestrator.execute( EngineExecutionOrchestrator.java:88 ) ~[na:na] at org.junit.platform.launcher.core.EngineExecutionOrchestrator.lambda$execute$0( EngineExecutionOrchestrator.java:54 ) ~[na:na] at org.junit.platform.launcher.core.EngineExecutionOrchestrator.withInterceptedStreams( EngineExecutionOrchestrator.java:67 ) ~[na:na] at org.junit.platform.launcher.core.EngineExecutionOrchestrator.execute( EngineExecutionOrchestrator.java:52 ) ~[na:na] at org.junit.platform.launcher.core.DefaultLauncher.execute( DefaultLauncher.java:114 ) ~[na:na] at org.junit.platform.launcher.core.DefaultLauncher.execute( DefaultLauncher.java:86 ) ~[na:na] at org.junit.platform.launcher.core.DefaultLauncherSession$DelegatingLauncher.execute( DefaultLauncherSession.java:86 ) ~[na:na] at org.junit.platform.launcher.core.SessionPerRequestLauncher.execute( SessionPerRequestLauncher.java:53 ) ~[na:na] at org.gradle.api.internal.tasks.testing.junitplatform.JUnitPlatformTestClassProcessor$CollectAllTestClassesExecutor.processAllTestClasses( JUnitPlatformTestClassProcessor.java:99 ) ~[na:na] at org.gradle.api.internal.tasks.testing.junitplatform.JUnitPlatformTestClassProcessor$CollectAllTestClassesExecutor.access$000( JUnitPlatformTestClassProcessor.java:79 ) ~[na:na] at org.gradle.api.internal.tasks.testing.junitplatform.JUnitPlatformTestClassProcessor.stop( JUnitPlatformTestClassProcessor.java:75 ) ~[na:na] at org.gradle.api.internal.tasks.testing.SuiteTestClassProcessor.stop( SuiteTestClassProcessor.java:62 ) ~[na:na] at java.base/jdk.internal.reflect.NativeMethodAccessorImpl.invoke0(Native Method) ~[na:na] at java.base/jdk.internal.reflect.NativeMethodAccessorImpl.invoke( NativeMethodAccessorImpl.java:62 ) ~[na:na] at java.base/jdk.internal.reflect.DelegatingMethodAccessorImpl.invoke( DelegatingMethodAccessorImpl.java:43 ) ~[na:na] at java.base/java.lang.reflect.Method.invoke( Method.java:566 ) ~[na:na] at org.gradle.internal.dispatch.ReflectionDispatch.dispatch( ReflectionDispatch.java:36 ) ~[na:na] at org.gradle.internal.dispatch.ReflectionDispatch.dispatch( ReflectionDispatch.java:24 ) ~[na:na] at org.gradle.internal.dispatch.ContextClassLoaderDispatch.dispatch( ContextClassLoaderDispatch.java:33 ) ~[na:na] at org.gradle.internal.dispatch.ProxyDispatchAdapter$DispatchingInvocationHandler.invoke( ProxyDispatchAdapter.java:94 ) ~[na:na] at com.sun.proxy.$Proxy2.stop(Unknown Source) ~[na:na] at org.gradle.api.internal.tasks.testing.worker.TestWorker$3.run( TestWorker.java:193 ) ~[na:na] at org.gradle.api.internal.tasks.testing.worker.TestWorker.executeAndMaintainThreadName( TestWorker.java:129 ) ~[na:na] at org.gradle.api.internal.tasks.testing.worker.TestWorker.execute( TestWorker.java:100 ) ~[na:na] at org.gradle.api.internal.tasks.testing.worker.TestWorker.execute( TestWorker.java:60 ) ~[na:na] at org.gradle.process.internal.worker.child.ActionExecutionWorker.execute( ActionExecutionWorker.java:56 ) ~[na:na] at org.gradle.process.internal.worker.child.SystemApplicationClassLoaderWorker.call ( SystemApplicationClassLoaderWorker.java:113 ) ~[na:na] at org.gradle.process.internal.worker.child.SystemApplicationClassLoaderWorker.call ( SystemApplicationClassLoaderWorker.java:65 ) ~[na:na] at worker.org.gradle.process.internal.worker.GradleWorkerMain.run ( GradleWorkerMain.java:69 ) ~[gradle-worker.jar:na] at worker.org .gradle.process.internal.worker.GradleWorkerMain.main( GradleWorkerMain.java:74 ) ~[gradle-worker.jar:na] Caused by: org.h2.jdbc.JdbcSQLInvalidAuthorizationSpecException: Wrong user name or password [28000-214] at org.h2.message.DbException.getJdbcSQLException( DbException.java:510 ) ~[h2-2.1.214.jar:2.1.214] at org.h2.engine.SessionRemote.readException( SessionRemote.java:637 ) ~[h2-2.1.214.jar:2.1.214] at org.h2.engine.SessionRemote.done( SessionRemote.java:606 ) ~[h2-2.1.214.jar:2.1.214] at org.h2.engine.SessionRemote.initTransfer( SessionRemote.java:163 ) ~[h2-2.1.214.jar:2.1.214] at org.h2.engine.SessionRemote.connectServer( SessionRemote.java:433 ) ~[h2-2.1.214.jar:2.1.214] at org.h2.engine.SessionRemote.connectEmbeddedOrServer( SessionRemote.java:325 ) ~[h2-2.1.214.jar:2.1.214] at org.h2.jdbc.JdbcConnection.<init>( JdbcConnection.java:122 ) ~[h2-2.1.214.jar:2.1.214] at org.h2.Driver.connect( Driver.java:59 ) ~[h2-2.1.214.jar:2.1.214] at com.zaxxer.hikari.util.DriverDataSource.getConnection( DriverDataSource.java:121 ) ~[HikariCP-4.0.3.jar:na] at com.zaxxer.hikari.pool.PoolBase.newConnection( PoolBase.java:364 ) ~[HikariCP-4.0.3.jar:na] at com.zaxxer.hikari.pool.PoolBase.newPoolEntry( PoolBase.java:206 ) ~[HikariCP-4.0.3.jar:na] at com.zaxxer.hikari.pool.HikariPool.createPoolEntry( HikariPool.java:476 ) ~[HikariCP-4.0.3.jar:na] at com.zaxxer.hikari.pool.HikariPool.checkFailFast( HikariPool.java:561 ) ~[HikariCP-4.0.3.jar:na] at com.zaxxer.hikari.pool.HikariPool.<init>( HikariPool.java:115 ) ~[HikariCP-4.0.3.jar:na] at com.zaxxer.hikari.HikariDataSource.getConnection( HikariDataSource.java:112 ) ~[HikariCP-4.0.3.jar:na] at org.springframework.jdbc.datasource.DataSourceTransactionManager.doBegin( DataSourceTransactionManager.java:265 ) ~[spring-jdbc-5.3.27.jar:5.3.27] ... 75 common frames omitted Could not open JDBC Connection for transaction; nested exception is org.h2.jdbc.JdbcSQLInvalidAuthorizationSpecException: Wrong user name or password [28000-214] at org.h2.message.DbException.getJdbcSQLException( DbException.java:510 ) at org.h2.message.DbException.getJdbcSQLException( DbException.java:477 ) at org.h2.message.DbException.get( DbException.java:223 ) at org.h2.message.DbException.get( DbException.java:199 ) at org.h2.message.DbException.get( DbException.java:188 ) at org.h2.engine.Engine.validateUserAndPassword( Engine.java:393 ) at org.h2.engine.Engine.createSession( Engine.java:206 ) at org.h2.server.TcpServerThread.run ( TcpServerThread.java:175 ) at java.base/java.lang.Thread.run( Thread.java:834 ) org.springframework.transaction.CannotCreateTransactionException: Could not open JDBC Connection for transaction; nested exception is org.h2.jdbc.JdbcSQLInvalidAuthorizationSpecException: Wrong user name or password [28000-214] at org.h2.message.DbException.getJdbcSQLException( DbException.java:510 ) at org.h2.message.DbException.getJdbcSQLException( DbException.java:477 ) at org.h2.message.DbException.get( DbException.java:223 ) at org.h2.message.DbException.get( DbException.java:199 ) at org.h2.message.DbException.get( DbException.java:188 ) at org.h2.engine.Engine.validateUserAndPassword( Engine.java:393 ) at org.h2.engine.Engine.createSession( Engine.java:206 ) at org.h2.server.TcpServerThread.run ( TcpServerThread.java:175 ) at java.base/java.lang.Thread.run( Thread.java:834 ) at app//org.springframework.jdbc.datasource.DataSourceTransactionManager.doBegin( DataSourceTransactionManager.java:309 ) at app//org.springframework.transaction.support.AbstractPlatformTransactionManager.startTransaction( AbstractPlatformTransactionManager.java:400 ) at app//org.springframework.transaction.support.AbstractPlatformTransactionManager.getTransaction( AbstractPlatformTransactionManager.java:373 ) at app//org.springframework.test.context.transaction.TransactionContext.startTransaction( TransactionContext.java:103 ) at app//org.springframework.test.context.transaction.TransactionalTestExecutionListener.beforeTestMethod( TransactionalTestExecutionListener.java:231 ) at app//org.springframework.test.context.TestContextManager.beforeTestMethod( TestContextManager.java:293 ) at app//org.springframework.test.context.junit.jupiter.SpringExtension.beforeEach( SpringExtension.java:174 ) at app//org.junit.jupiter.engine.descriptor.TestMethodTestDescriptor.lambda$invokeBeforeEachCallbacks$2( TestMethodTestDescriptor.java:163 ) at app//org.junit.jupiter.engine.descriptor.TestMethodTestDescriptor.lambda$invokeBeforeMethodsOrCallbacksUntilExceptionOccurs$6( TestMethodTestDescriptor.java:199 ) at app//org.junit.platform.engine.support.hierarchical.ThrowableCollector.execute( ThrowableCollector.java:73 ) at app//org.junit.jupiter.engine.descriptor.TestMethodTestDescriptor.invokeBeforeMethodsOrCallbacksUntilExceptionOccurs( TestMethodTestDescriptor.java:199 ) at app//org.junit.jupiter.engine.descriptor.TestMethodTestDescriptor.invokeBeforeEachCallbacks( TestMethodTestDescriptor.java:162 ) at app//org.junit.jupiter.engine.descriptor.TestMethodTestDescriptor.execute( TestMethodTestDescriptor.java:129 ) at app//org.junit.jupiter.engine.descriptor.TestMethodTestDescriptor.execute( TestMethodTestDescriptor.java:66 ) at app//org.junit.platform.engine.support.hierarchical.NodeTestTask.lambda$executeRecursively$6( NodeTestTask.java:151 ) at app//org.junit.platform.engine.support.hierarchical.ThrowableCollector.execute( ThrowableCollector.java:73 ) at app//org.junit.platform.engine.support.hierarchical.NodeTestTask.lambda$executeRecursively$8( NodeTestTask.java:141 ) at app//org.junit.platform.engine.support.hierarchical.Node.around( Node.java:137 ) at app//org.junit.platform.engine.support.hierarchical.NodeTestTask.lambda$executeRecursively$9( NodeTestTask.java:139 ) at app//org.junit.platform.engine.support.hierarchical.ThrowableCollector.execute( ThrowableCollector.java:73 ) at app//org.junit.platform.engine.support.hierarchical.NodeTestTask.executeRecursively( NodeTestTask.java:138 ) at app//org.junit.platform.engine.support.hierarchical.NodeTestTask.execute( NodeTestTask.java:95 ) at java.base@11.0.19/java.util.ArrayList.forEach( ArrayList.java:1541 ) at app//org.junit.platform.engine.support.hierarchical.SameThreadHierarchicalTestExecutorService.invokeAll( SameThreadHierarchicalTestExecutorService.java:41 ) at app//org.junit.platform.engine.support.hierarchical.NodeTestTask.lambda$executeRecursively$6( NodeTestTask.java:155 ) at app//org.junit.platform.engine.support.hierarchical.ThrowableCollector.execute( ThrowableCollector.java:73 ) at app//org.junit.platform.engine.support.hierarchical.NodeTestTask.lambda$executeRecursively$8( NodeTestTask.java:141 ) at app//org.junit.platform.engine.support.hierarchical.Node.around( Node.java:137 ) at app//org.junit.platform.engine.support.hierarchical.NodeTestTask.lambda$executeRecursively$9( NodeTestTask.java:139 ) at app//org.junit.platform.engine.support.hierarchical.ThrowableCollector.execute( ThrowableCollector.java:73 ) at app//org.junit.platform.engine.support.hierarchical.NodeTestTask.executeRecursively( NodeTestTask.java:138 ) at app//org.junit.platform.engine.support.hierarchical.NodeTestTask.execute( NodeTestTask.java:95 ) at java.base@11.0.19/java.util.ArrayList.forEach( ArrayList.java:1541 ) at app//org.junit.platform.engine.support.hierarchical.SameThreadHierarchicalTestExecutorService.invokeAll( SameThreadHierarchicalTestExecutorService.java:41 ) at app//org.junit.platform.engine.support.hierarchical.NodeTestTask.lambda$executeRecursively$6( NodeTestTask.java:155 ) at app//org.junit.platform.engine.support.hierarchical.ThrowableCollector.execute( ThrowableCollector.java:73 ) at app//org.junit.platform.engine.support.hierarchical.NodeTestTask.lambda$executeRecursively$8( NodeTestTask.java:141 ) at app//org.junit.platform.engine.support.hierarchical.Node.around( Node.java:137 ) at app//org.junit.platform.engine.support.hierarchical.NodeTestTask.lambda$executeRecursively$9( NodeTestTask.java:139 ) at app//org.junit.platform.engine.support.hierarchical.ThrowableCollector.execute( ThrowableCollector.java:73 ) at app//org.junit.platform.engine.support.hierarchical.NodeTestTask.executeRecursively( NodeTestTask.java:138 ) at app//org.junit.platform.engine.support.hierarchical.NodeTestTask.execute( NodeTestTask.java:95 ) at app//org.junit.platform.engine.support.hierarchical.SameThreadHierarchicalTestExecutorService.submit( SameThreadHierarchicalTestExecutorService.java:35 ) at app//org.junit.platform.engine.support.hierarchical.HierarchicalTestExecutor.execute( HierarchicalTestExecutor.java:57 ) at app//org.junit.platform.engine.support.hierarchical.HierarchicalTestEngine.execute( HierarchicalTestEngine.java:54 ) at org.junit.platform.launcher.core.EngineExecutionOrchestrator.execute( EngineExecutionOrchestrator.java:107 ) at org.junit.platform.launcher.core.EngineExecutionOrchestrator.execute( EngineExecutionOrchestrator.java:88 ) at org.junit.platform.launcher.core.EngineExecutionOrchestrator.lambda$execute$0( EngineExecutionOrchestrator.java:54 ) at org.junit.platform.launcher.core.EngineExecutionOrchestrator.withInterceptedStreams( EngineExecutionOrchestrator.java:67 ) at org.junit.platform.launcher.core.EngineExecutionOrchestrator.execute( EngineExecutionOrchestrator.java:52 ) at org.junit.platform.launcher.core.DefaultLauncher.execute( DefaultLauncher.java:114 ) at org.junit.platform.launcher.core.DefaultLauncher.execute( DefaultLauncher.java:86 ) at org.junit.platform.launcher.core.DefaultLauncherSession$DelegatingLauncher.execute( DefaultLauncherSession.java:86 ) at org.junit.platform.launcher.core.SessionPerRequestLauncher.execute( SessionPerRequestLauncher.java:53 ) at org.gradle.api.internal.tasks.testing.junitplatform.JUnitPlatformTestClassProcessor$CollectAllTestClassesExecutor.processAllTestClasses( JUnitPlatformTestClassProcessor.java:99 ) at org.gradle.api.internal.tasks.testing.junitplatform.JUnitPlatformTestClassProcessor$CollectAllTestClassesExecutor.access$000( JUnitPlatformTestClassProcessor.java:79 ) at org.gradle.api.internal.tasks.testing.junitplatform.JUnitPlatformTestClassProcessor.stop( JUnitPlatformTestClassProcessor.java:75 ) at org.gradle.api.internal.tasks.testing.SuiteTestClassProcessor.stop( SuiteTestClassProcessor.java:62 ) at java.base@11.0.19/jdk.internal.reflect.NativeMethodAccessorImpl.invoke0(Native Method) at java.base@11.0.19/jdk.internal.reflect.NativeMethodAccessorImpl.invoke( NativeMethodAccessorImpl.java:62 ) at java.base@11.0.19/jdk.internal.reflect.DelegatingMethodAccessorImpl.invoke( DelegatingMethodAccessorImpl.java:43 ) at java.base@11.0.19/java.lang.reflect.Method.invoke( Method.java:566 ) at org.gradle.internal.dispatch.ReflectionDispatch.dispatch( ReflectionDispatch.java:36 ) at org.gradle.internal.dispatch.ReflectionDispatch.dispatch( ReflectionDispatch.java:24 ) at org.gradle.internal.dispatch.ContextClassLoaderDispatch.dispatch( ContextClassLoaderDispatch.java:33 ) at org.gradle.internal.dispatch.ProxyDispatchAdapter$DispatchingInvocationHandler.invoke( ProxyDispatchAdapter.java:94 ) at com.sun.proxy.$Proxy2.stop(Unknown Source) at org.gradle.api.internal.tasks.testing.worker.TestWorker$3.run( TestWorker.java:193 ) at org.gradle.api.internal.tasks.testing.worker.TestWorker.executeAndMaintainThreadName( TestWorker.java:129 ) at org.gradle.api.internal.tasks.testing.worker.TestWorker.execute( TestWorker.java:100 ) at org.gradle.api.internal.tasks.testing.worker.TestWorker.execute( TestWorker.java:60 ) at org.gradle.process.internal.worker.child.ActionExecutionWorker.execute( ActionExecutionWorker.java:56 ) at org.gradle.process.internal.worker.child.SystemApplicationClassLoaderWorker.call ( SystemApplicationClassLoaderWorker.java:113 ) at org.gradle.process.internal.worker.child.SystemApplicationClassLoaderWorker.call ( SystemApplicationClassLoaderWorker.java:65 ) at app//worker.org.gradle.process.internal.worker.GradleWorkerMain.run( GradleWorkerMain.java:69 ) at app//worker.org.gradle.process.internal.worker.GradleWorkerMain.main( GradleWorkerMain.java:74 ) Caused by: org.h2.jdbc.JdbcSQLInvalidAuthorizationSpecException: Wrong user name or password [28000-214] at org.h2.message.DbException.getJdbcSQLException( DbException.java:510 ) at org.h2.message.DbException.getJdbcSQLException( DbException.java:477 ) at org.h2.message.DbException.get( DbException.java:223 ) at org.h2.message.DbException.get( DbException.java:199 ) at org.h2.message.DbException.get( DbException.java:188 ) at org.h2.engine.Engine.validateUserAndPassword( Engine.java:393 ) at org.h2.engine.Engine.createSession( Engine.java:206 ) at org.h2.server.TcpServerThread.run ( TcpServerThread.java:175 ) at java.base/java.lang.Thread.run( Thread.java:834 ) at app//org.h2.message.DbException.getJdbcSQLException( DbException.java:510 ) at app//org.h2.engine.SessionRemote.readException( SessionRemote.java:637 ) at app//org.h2.engine.SessionRemote.done( SessionRemote.java:606 ) at app//org.h2.engine.SessionRemote.initTransfer( SessionRemote.java:163 ) at app//org.h2.engine.SessionRemote.connectServer( SessionRemote.java:433 ) at app//org.h2.engine.SessionRemote.connectEmbeddedOrServer( SessionRemote.java:325 ) at app//org.h2.jdbc.JdbcConnection.<init>( JdbcConnection.java:122 ) at app//org.h2.Driver.connect( Driver.java:59 ) at app//com.zaxxer.hikari.util.DriverDataSource.getConnection( DriverDataSource.java:121 ) at app//com.zaxxer.hikari.pool.PoolBase.newConnection( PoolBase.java:364 ) at app//com.zaxxer.hikari.pool.PoolBase.newPoolEntry( PoolBase.java:206 ) at app//com.zaxxer.hikari.pool.HikariPool.createPoolEntry( HikariPool.java:476 ) at app//com.zaxxer.hikari.pool.HikariPool.checkFailFast( HikariPool.java:561 ) at app//com.zaxxer.hikari.pool.HikariPool.<init>( HikariPool.java:115 ) at app//com.zaxxer.hikari.HikariDataSource.getConnection( HikariDataSource.java:112 ) at app//org.springframework.jdbc.datasource.DataSourceTransactionManager.doBegin( DataSourceTransactionManager.java:265 ) ... 75 more MemberServiceIntegrationTest > ߺ ȸ () FAILED org.springframework.transaction.CannotCreateTransactionException at DataSourceTransactionManager.java:309 Caused by: org.h2.jdbc.JdbcSQLInvalidAuthorizationSpecException at DbException.java:510 MemberServiceIntegrationTest > join() FAILED org.springframework.transaction.CannotCreateTransactionException at DataSourceTransactionManager.java:309 Caused by: org.h2.jdbc.JdbcSQLInvalidAuthorizationSpecException at DbException.java:510 2 tests completed, 2 failed > Task :test FAILED FAILURE: Build failed with an exception. * What went wrong: Execution failed for task ':test'. > There were failing tests. See the report at: file:///C:/Users/ ̾ /Desktop/hello-spring/build/reports/tests/test/index.html * Try: > Run with --stacktrace option to get the stack trace. > Run with --info or --debug option to get more log output. > Run with --scan to get full insights. * Get more help at https://help.gradle.org BUILD FAILED in 16s 4 actionable tasks: 2 executed, 2 up-to-date
안녕하세요 초보 개발자 입니다. 강의 너무 잘 듣고 있어요! 궁금한 점이 있어서 질문 드립니다. security 필터를 다 거치고 Controller에서 주소가 api/admin이면 Authentication객체의 role이 ADMIN인지 확인 한다고 하셨는데, securityConfig의 antMatchers("/api/admin/**").hasRole("" + UserEnum.ADMIN) 이부분에서 설정 했다고 생각합니다. 궁금한 점이 꼭 Authentication객체에서 ADMIN을 가지고 있는 변수의 이름이 꼭 role이여야만 가능 한걸까요? security에서 api/admin이 나오면 Authentication객체 내부에서 role이란 이름을 가진 변수를 찾아보는 걸까요? 아니면 해당사항을 설정한 사항이 따로 있었을까요? 답변 감사합니다!