function useLogout(mutationOptions?: UseMutationCustomOptions) { return useMutation({ mutationFn: async () => { await axiosInstance.post('/auth/logout'); // 로그아웃 요청을 서버에 먼저 보냄 removeHeader('Authorization'); await removeEncryptStorage(storageKeys.REFRESH_TOKEN); queryClient.resetQueries({queryKey: [queryKeys.AUTH]}); }, ...mutationOptions }); } 안녕하세요 강사님 강사님의 리액트 네이티브 강의를 보면서 직접 자신만의 리액트 네이티브 프로젝트도 직접 다뤄보면서 하고 있는 학생입니다. https://github.com/Dongrang072/carPoolTeamProject-server 이게 현재 제가 작성하고 있는 로컬 서버의 코드이고 https://github.com/Dongrang072/carpoolTeamProject 이게 프론트의 코드입니다 기존의 로그아웃 코드가 잘 작동하지 않아서, 코드를 이런식으로 고치고 난 후에 실행했는데 로그아웃으로 네비게이터가 authStack에 관련된 화면을 다시 보여주고 난 후에 이후 로그인까지는 의도적으로 되지만 로그인을 다시 실행하면 이전에 스토리지가 다 지워지지 않았는지 계정을 바꿔서 로그인 할 경우 전에 있던 계정으로 로그인이 되는 현상이 발생하고 있습니다. 분명 헤더와 스토리지를 지움으로서 accessToken과 refreshToken 둘 다 지운걸로 생각했는데 이런 일이 생기는 이유가 궁금합니다. 로그아웃 엔드포인트 호출까지 진행되고 다시 화면이 랜더링 되어서 저는 괜찮았다고 생각했는데 이후 storage가 다 지워지지 않는 것이 원인인것 같습니다
계산기 앱 개발과 마찬가지로, 다음과 같은 프로젝트 설치 및 실행을 진행하였습니다. <기종 : Android> npx create-expo-app <앱 이름> --template 세 번째(blank) :typescript 선택 npx expo start를 실행 expo 앱에서 QR 코드로 보기 이전 강의(레이아웃 구성하기)의 중간(7:23)에 나오는 텍스트 창을 클릭하면 UI가 따라 올라가는 것을 방지하기 위한 설정방법이 제 것에서는 나타나지 않았습니다. 검색 창에 windowsoftinputmode 또는 AndroidManifest 를 검색해도 나타나지 않았습니다. (아무래도, 제가 설치를 잘못해서 나타났거나 expo로 빌드했기에 나타나지 않는 것 같습니다. VSCode는 기존에 사용했던 터라 해당되지 않는 것 같습니다.) 이를 해결하기 위해, Picker를 감싸고 있는 View를 Wrapper라고 이름을 변경한 후에, postion: absolute 속성을 부여했습니다. +) 텍스트 입력 글자가 꽤 길어지면, 줄바꿈이 되지 않고 글자가 잘려나가는 현상이 있습니다. 이를 해결하는 방법으로는 multiline={true}를 추가해주면 됩니다. 코드는 아래와 같습니다. import { StatusBar } from 'expo-status-bar'; import React, { useState } from 'react'; import { Text, TextInput, View, Dimensions } from 'react-native'; import Translator from 'react-native-translator'; import styled from 'styled-components/native'; import { Picker } from '@react-native-picker/picker'; const Container = styled.View` background-color: #181818; flex: 1; padding-top: 20px; `; const Wrapper = styled.View` position: absolute; top: 40px; left: 0; right: 0; padding-horizontal: 10px; `; const InputView = styled.View` background-color: #606060; height: 250px; justify-content: left; align-items: start; padding: 10px; border-radius: 10px; margin-bottom: 80px; `; const ResultView = styled(InputView)` background-color: #0084ff; margin-bottom: 10px; `; const App = () => { const [value, setValue] = useState(''); const [result, setResult] = useState(''); const [fromLang, setFromLang] = useState('en'); const [toLang, setToLang] = useState('ko'); return ( <Container> <StatusBar style="light" /> <Translator from={fromLang} to={toLang} value={value} onTranslated={(t) => setResult(t)} /> <Wrapper> <Picker style={{ marginBottom: 10, backgroundColor: '#606060' }} selectedValue={fromLang} onValueChange={(itemValue) => setFromLang(itemValue)} > <Picker.Item label="한국어" value="ko" /> </Picker> <InputView> <TextInput style={{ fontSize: 24, color: 'white' }} value={value} onChangeText={(t) => setValue(t)} multiline={true} placeholder="번역할 텍스트 입력" /> </InputView> <Picker style={{ marginBottom: 10, backgroundColor: '#0084ff' }} selectedValue={toLang} onValueChange={(itemValue) => setToLang(itemValue)} > <Picker.Item label="영어" value="en" /> </Picker> <ResultView> <Text style={{ fontSize: 24, color: 'white' }}>{result}</Text> </ResultView> </Wrapper> </Container> ); }; export default App; ps) 간혹 글자를 입력하면 즉각 번역되지 않고, 번역되는 아래쪽 Picker를 클릭한 후에야 동작하긴 합니다. 이를 해결하기 위해서는 useEffect를 사용하면 해결되지만 강의에서는 다루지 않아 코드에 반영하지 않았습니다. GPT가 잘 알려주니까 궁금하신 분들은 해보시면 좋을 것 같습니다~ ps) 업데이트 하시면서, 영상이 잘못배치된 것 같습니다~ 번역앱 원리와 이해 부분에 코인에 관한 영상이 재생됩니다. 코인 관련, 날씨앱에서는 이상이 없었습니다~ 좋은 강의 감사합니다~!! 덕분에 많은 도움이 되고 있습니다.
안녕하세요? 그랩선생님, 수고가 많으십니다. 다름이 아니라 강의 [컴포넌트 사용하기] 강의를 진행하던 중 2가지 에러가 발생하여 질문을 하게 되었습니다. 첫번째 에러는 아래 사진으로 첨부합니다. 첫번째 에러 사진의 크롬 브라우저 제목은 listing directory / 라고 뜹니다. 그다음에 src디렉토리에 가서 App.js를 열면 첨부사진 처럼 입력된 소스화일 내용이 아래와 같이 뜨는데 어떻게 해야 크롬 브라우저로 로고까지 뜨게 되나요? 그리고 두번째 에러는 실제 소스 파일 폴더에 가서 App.js 파일을 선택 후 엔터(실행)하니 아래 사진과 같은 에러가 발생하였습니다. --> 이 두가지 에러를 어떻게 하면 해결 할 수 있는지 상세한 설명과 자세한 답변 부탁드립니다. 감사합니다.
❗ 질문 작성시 꼭 참고해주세요 현재 문제(또는 에러)와 코드(또는 github) 를 첨부해주세요. 맥/윈도우, 안드로이드/iOS, ReactNative, Node 버전 등의 개발환경 을 함께 적어주시면 도움이 됩니다. 에러메세지는 일부분이 아닌 전체 상황 을 올려주세요. ( 일부만 자르거나 복사하지말아주세요 .) 개발환경/코드에 대한 정보가 없을경우 답변이 어렵습니다. 강사님 안녕하세요. 지금 mac m3환경에서 개발중입니다. react-native 버젼 : 0.72.6 현재 [2-5] Drawer Navigation을 수강중인데요, 아이폰은 빌드 성공했는데 안드로이드에서 계속 빌드가 실패하고 있습니다. gpt에게 한번 질문을 해보니 버전을 올리라고하더라구요. 그럼 기존에 맞춰놓은 것들이 깨질까봐 걱정되어서 질문드립니다. 어떻게 하면좋을까요? 터미널: info 💡 Tip: Make sure that you have set up your development environment correctly, by running react-native doctor. To read more about doctor command visit: https://github.com/react-native-community/cli/blob/main/packages/cli-doctor/README.md#doctor /Users/rengoku/Documents/projects/Matzip/front/node_modules/react-native-reanimated/android/src/main/java/com/swmansion/reanimated/NodesManager.java:440: error: switch rules are not supported in -source 11 case "opacity" -> { ^ (use -source 14 or higher to enable switch rules) /Users/rengoku/Documents/projects/Matzip/front/node_modules/react-native-reanimated/android/src/main/java/com/swmansion/reanimated/layoutReanimation/AnimationsManager.java:356: error: pattern matching in instanceof is not supported in -source 11 if (props.get(Snapshot.TRANSFORM_MATRIX) instanceof ReadableNativeArray matrixArray) { ^ (use -source 16 or higher to enable pattern matching in instanceof) 2 errors FAILURE: Build failed with an exception. * What went wrong: Execution failed for task ':react-native-reanimated:compileDebugJavaWithJavac'. > Compilation failed; see the compiler error output for details. * Try: > Run with --stacktrace option to get the stack trace. > Run with --info or --debug option to get more log output. > Run with --scan to get full insights. * Get more help at https://help.gradle.org BUILD FAILED in 3s info Run CLI with --verbose flag for more details. 버전 정보입니다. "dependencies": { "@react-native-masked-view/masked-view": "^0.3.2", "@react-navigation/drawer": "^7.0.5", "@react-navigation/native": "^7.0.3", "@react-navigation/stack": "^7.0.3", "react": "18.2.0", "react-native": "0.72.6", "react-native-gesture-handler": "^2.21.2", "react-native-reanimated": "^3.16.1", "react-native-safe-area-context": "^4.14.0", "react-native-screens": "^4.1.0" }, "devDependencies": { "@babel/core": "^7.20.0", "@babel/preset-env": "^7.20.0", "@babel/runtime": "^7.20.0", "@react-native/eslint-config": "^0.72.2", "@react-native/metro-config": "^0.72.11", "@tsconfig/react-native": "^3.0.0", "@types/react": "^18.0.24", "@types/react-test-renderer": "^18.0.0", "babel-jest": "^29.2.1", "eslint": "^8.19.0", "jest": "^29.2.1", "metro-react-native-babel-preset": "0.76.8", "prettier": "^2.4.1", "react-test-renderer": "18.2.0", "typescript": "4.8.4" }, "engines": { "node": ">=16" }
iOS에서 사진의 주소값을 ph://와 같은 주소를 반환하는데 해당 주소를 처리할 수 없다고 뜨는데 어떻게하면 좋을까요? 오류문은 다음과 같습니다. No suitable URL request handler found for ph://17370BD6-D19B-4C06-9180-03BB64CF2AD2/L0/001 -[RCTNetworking networkTaskWithRequest:completionBlock:] RCTNetworking.mm:706 -[RCTImageLoader _loadURLRequest:progressBlock:completionBlock:] __139-[RCTImageLoader loadImageOrDataWithURLRequest:size:scale:resizeMode:priority:attribution:progressBlock:partialLoadBlock:completionBlock:] block_invoke.159 dispatch call_block_and_release dispatch client_callout dispatch lane_serial_drain dispatch lane_invoke dispatch root_queue_drain_deferred_wlh dispatch workloop_worker_thread pthread wqthread start_wqthread 안드로이드 쪽에서는 사진이 정상적으로 목록이 조회되는 것을 알 수 있었습니다!
❗ 질문 작성시 꼭 참고해주세요 현재 문제(또는 에러)와 코드(또는 github) 를 첨부해주세요. 맥/윈도우, 안드로이드/iOS, ReactNative, Node 버전 등의 개발환경 을 함께 적어주시면 도움이 됩니다. 에러메세지는 일부분이 아닌 전체 상황 을 올려주세요. ( 일부만 자르거나 복사하지말아주세요 .) 개발환경/코드에 대한 정보가 없을경우 답변이 어렵습니다. 이거 무슨 오류일까요ㅜㅜ
강의에서 <android:exported="false"> 부분 이후 안드로이드 실행시 Execution failed for task ':app:checkDebugDuplicateClasses'. 오류가 나면 gradle.properties 파일에 아래 부분을 추가해보세요 android.useAndroidX=true android.enableJetifier=true
❗ 질문 작성시 꼭 참고해주세요 현재 문제(또는 에러)와 코드(또는 github) 를 첨부해주세요. 맥/윈도우, 안드로이드/iOS, ReactNative, Node 버전 등의 개발환경 을 함께 적어주시면 도움이 됩니다. 에러메세지는 일부분이 아닌 전체 상황 을 올려주세요. ( 일부만 자르거나 복사하지말아주세요 .) 개발환경/코드에 대한 정보가 없을경우 답변이 어렵습니다. 서버도 켰고 코드에 문제도 없어보이는데 회원가입해도 DB에 아무런 값이 안들어가네요 네트워크에러 어떻게 해결해야하나요..
❗ 질문 작성시 꼭 참고해주세요 현재 문제(또는 에러)와 코드(또는 github) 를 첨부해주세요. 맥/윈도우, 안드로이드/iOS, ReactNative, Node 버전 등의 개발환경 을 함께 적어주시면 도움이 됩니다. 에러메세지는 일부분이 아닌 전체 상황 을 올려주세요. ( 일부만 자르거나 복사하지말아주세요 .) 개발환경/코드에 대한 정보가 없을경우 답변이 어렵습니다. axios.ts에서 BaseURL 바꿔도 로그인이 안됩니다...
❗ 질문 작성시 꼭 참고해주세요 현재 문제(또는 에러)와 코드(또는 github) 를 첨부해주세요. 맥/윈도우, 안드로이드/iOS, ReactNative, Node 버전 등의 개발환경 을 함께 적어주시면 도움이 됩니다. 에러메세지는 일부분이 아닌 전체 상황 을 올려주세요. ( 일부만 자르거나 복사하지말아주세요 .) 개발환경/코드에 대한 정보가 없을경우 답변이 어렵습니다. 아래 두가지 오류가 계속 반복됩니다. 윈도우입니다. 그리고 영상에서 로그인을 하고 지도를 보는데 로그인 아이디 비번은 그냥 아무거나 하면 되나용?
안녕하세요 문득 궁금해서 질문드립니다. 리액트쿼리 공식문서를보면 const { isPending, error, data } = useQuery({ queryKey: ['repoData'], queryFn: () => fetch('https://api.github.com/repos/TanStack/query').then((res) => res.json(), ), }) if (isPending) return 'Loading...' if (error) return 'An error has occurred: ' + error.message 이렇게 항상 값이 있다는 가정하에 데이터를 사용하게 하는데 MapHomeScreen이나 MapLegend 등에선 const {categories} = getProfileQuery.data || {}; 이런식으로 하시더라구요 실제로 저는 MapHomeScreen 스크린에서 마커가 클릭후에 나타나는 현상이 있어서 const {data: markers = [], isPending, error} = useGetMarkers(); if (isPending || error) return <></>; 이렇게 데이터가 로딩또는 에러가 아닐때 다음 구문으로 넘어가게 하니 마커가 잘 나타났습니다 제가 궁금한건 if (isPending || error) return <></>; 처리를 해줄때와 안해줘도 될 때가 따로 있는것인지 그게 궁금합니다~
$ npm start > MatzipApp@0.0.1 start > react-native start ▒▒▓▓▓▓▒▒ ▒▓▓▓▒▒░░▒▒▓▓▓▒ ▒▓▓▓▓░░░▒▒▒▒░░░▓▓▓▓▒ ▓▓▒▒▒▓▓▓▓▓▓▓▓▓▓▓▓▒▒▒▓▓ ▓▓░░░░░▒▓▓▓▓▓▓▒░░░░░▓▓ ▓▓░░▓▓▒░░░▒▒░░░▒▓▒░░▓▓ ▓▓░░▓▓▓▓▓▒▒▒▒▓▓▓▓▒░░▓▓ ▓▓░░▓▓▓▓▓▓▓▓▓▓▓▓▓▒░░▓▓ ▓▓▒░░▒▒▓▓▓▓▓▓▓▓▒░░░▒▓▓ ▒▓▓▓▒░░░▒▓▓▒░░░▒▓▓▓▒ ▒▓▓▓▒░░░░▒▓▓▓▒ ▒▒▓▓▓▓▒▒ Welcome to Metro v0.76.8 Fast - Scalable - Integrated r - reload the app d - open developer menu i - run on iOS a - run on Android info Opening the app on Android... info JS server already running. info Launching emulator... info Installing the app... > Task :gradle-plugin:compileKotlin UP-TO-DATE > Task :gradle-plugin:compileJava NO-SOURCE > Task :gradle-plugin:pluginDescriptors UP-TO-DATE > Task :gradle-plugin:processResources UP-TO-DATE > Task :gradle-plugin:classes UP-TO-DATE > Task :gradle-plugin:jar UP-TO-DATE > Task :gradle-plugin:inspectClassesForKotlinIC UP-TO-DATE > Task :app:buildCodegenCLI SKIPPED > Task :app:generateCodegenSchemaFromJavaScript SKIPPED > Task :app:generateCodegenArtifactsFromSchema SKIPPED > Task :app:generatePackageList > Task :app:preBuild > Task :app:preDebugBuild > Task :app:compileDebugAidl NO-SOURCE > Task :app:compileDebugRenderscript NO-SOURCE > Task :app:generateDebugBuildConfig UP-TO-DATE > Task :app:javaPreCompileDebug UP-TO-DATE > Task :app:checkDebugAarMetadata UP-TO-DATE > Task :app:generateDebugResValues UP-TO-DATE > Task :app:mapDebugSourceSetPaths UP-TO-DATE > Task :app:generateDebugResources UP-TO-DATE > Task :app:mergeDebugResources UP-TO-DATE > Task :app:createDebugCompatibleScreenManifests UP-TO-DATE > Task :app:extractDeepLinksDebug UP-TO-DATE > Task :app:processDebugMainManifest UP-TO-DATE > Task :app:processDebugManifest UP-TO-DATE > Task :app:processDebugManifestForPackage UP-TO-DATE > Task :app:processDebugResources UP-TO-DATE > Task :app:compileDebugJavaWithJavac UP-TO-DATE > Task :app:mergeDebugShaders UP-TO-DATE > Task :app:compileDebugShaders NO-SOURCE > Task :app:generateDebugAssets UP-TO-DATE > Task :app:mergeDebugAssets UP-TO-DATE > Task :app:compressDebugAssets UP-TO-DATE > Task :app:processDebugJavaRes NO-SOURCE > Task :app:mergeDebugJavaResource UP-TO-DATE > Task :app:checkDebugDuplicateClasses UP-TO-DATE > Task :app:desugarDebugFileDependencies UP-TO-DATE > Task :app:mergeExtDexDebug UP-TO-DATE > Task :app:mergeLibDexDebug UP-TO-DATE > Task :app:dexBuilderDebug UP-TO-DATE > Task :app:mergeProjectDexDebug UP-TO-DATE > Task :app:mergeDebugJniLibFolders UP-TO-DATE > Task :app:mergeDebugNativeLibs UP-TO-DATE > Task :app:stripDebugDebugSymbols UP-TO-DATE > Task :app:validateSigningDebug UP-TO-DATE > Task :app:writeDebugAppMetadata UP-TO-DATE > Task :app:writeDebugSigningConfigVersions UP-TO-DATE > Task :app:packageDebug UP-TO-DATE > Task :app:createDebugApkListingFileRedirect UP-TO-DATE > Task :app:installDebug FAILED 38 actionable tasks: 2 executed, 36 up-to-date info 💡 Tip: Make sure that you have set up your development environment correctly, by running react-native doctor. To read more about doctor command visit: https://github.com/react-native-community/cli/blob/main/packages/cli-doctor/README.md#doctor Warning: SDK processing. This version only understands SDK XML versions up to 3 but an SDK XML file of version 4 was encountered. This can happen if you use versions of Android Studio and the command-line tools that were released at different times. FAILURE: Build failed with an exception. * What went wrong: Execution failed for task ':app:installDebug'. > com.android.builder.testing.api.DeviceException: No connected devices! * Try: > Run with --stacktrace option to get the stack trace. > Run with --info or --debug option to get more log output. > Run with --scan to get full insights. * Get more help at https://help.gradle.org BUILD FAILED in 15s info Run CLI with --verbose flag for more details. 프로젝트 버전을 0.72.6로 했던 것 같은데, 아니네욤 $ npx react-native doctor Common ✓ Node.js - Required to execute JavaScript code ✓ npm - Required to install NPM dependencies Android ✖ Adb - No devices and/or emulators connected. Please create emulator with Android Studio or connect Android device. ✓ JDK - Required to compile Java code ✓ Android Studio - Required for building and installing your app on Android ✖ Android SDK - Required for building and installing your app on Android - Versions found: N/A - Version supported: 33.0.0 ✓ ANDROID_HOME - Environment variable that points to your Android SDK installation Errors: 2 Warnings: 0 Android ✖ Adb √ Select the device / emulator you want to use » Emulator Pixel_5_API_33 (disconnected) ✔ Adb ✔ Android SDK configured. You might need to restart your PC for all changes to take effect.! C:\Users[사용자이름]\AppData\Local\Google\AndroidStudio2024.1\log idea.log WARN - Emulator: Medium Phone API 35 - Emulator terminated with exit code -529697949 C:\Windows\System32>npx react-native -v 11.3.7 C:\Windows\System32>java -version openjdk version "17.0.8.1" 2023-08-24 OpenJDK Runtime Environment Temurin-17.0.8.1+1 (build 17.0.8.1+1) OpenJDK 64-Bit Server VM Temurin-17.0.8.1+1 (build 17.0.8.1+1, mixed mode, sharing) 사용자 변수의 PATH 사용자 변수 해결이 잘 안 되네요 ㅠㅠ ANDROID_HOME 환경 변수는 C 드라이브 밑에 제가 만든 폴더 경로(SDK 설치 단계에서 한 경로)로 잘 해두었습니다. Graphics 설정을 Software로 변경해보고 Windows 보안에서 폴더 제거해보고 인텔 그래픽 드라이버 업데이트해보고 메모리도 키워 보고