혹시 코드를 수정하고 계속 commit 해서, 맨 처음에 clone 했을 때의 코드와 현재 코드가 다른데 추가로 어떤 명령어를 더 입력해야 하나요 ? 깃허브 주소입니다 ! https://github.com/jjeong1015/memberCertification/tree/main
ubuntu@ip-172-31-86-200:~/memberCertification$ ./gradlew clean build Deprecated Gradle features were used in this build, making it incompatible with Gradle 9.0. You can use '--warning-mode all' to show the individual deprecation warnings and determine if they come from your own scripts or plugins. For more on this, please refer to https://docs.gradle.org/8.7/userguide/command_line_interface.html#sec:command_line_warnings in the Gradle documentation. BUILD FAILED in 15s 8 actionable tasks: 8 executed ubuntu@ip-172-31-86-200:~/memberCertification$ ./gradlew clean build > Task :test MemberCertificationApplicationTests > contextLoads() FAILED java.lang.IllegalStateException at DefaultCacheAwareContextLoaderDelegate.java:180 Caused by: org.springframework.beans.factory.BeanCreationException at AbstractAutowireCapableBeanFactory.java:1773 Caused by: org.hibernate.service.spi.ServiceException at AbstractServiceRegistryImpl.java:276 Caused by: org.hibernate.HibernateException at DialectFactoryImpl.java:191 1 test completed, 1 failed > Task :test FAILED FAILURE: Build failed with an exception. * What went wrong: Execution failed for task ':test'. > There were failing tests. See the report at: file:///home/ubuntu/memberCertification/build/reports/tests/test/index.html * Try: > Run with --scan to get full insights. Deprecated Gradle features were used in this build, making it incompatible with Gradle 9.0. You can use '--warning-mode all' to show the individual deprecation warnings and determine if they come from your own scripts or plugins. For more on this, please refer to https://docs.gradle.org/8.7/userguide/command_line_interface.html#sec:command_line_warnings in the Gradle documentation. BUILD FAILED in 15s 8 actionable tasks: 8 executed ubuntu@ip-172-31-86-200:~/memberCertification$ ./gradlew clean build > Task :test MemberCertificationApplicationTests > contextLoads() FAILED java.lang.IllegalStateException at DefaultCacheAwareContextLoaderDelegate.java:180 Caused by: org.springframework.beans.factory.BeanCreationException at AbstractAutowireCapableBeanFactory.java:1773 Caused by: org.hibernate.service.spi.ServiceException at AbstractServiceRegistryImpl.java:276 Caused by: org.hibernate.HibernateException at DialectFactoryImpl.java:191 1 test completed, 1 failed > Task :test FAILED FAILURE: Build failed with an exception. * What went wrong: Execution failed for task ':test'. > There were failing tests. See the report at: file:///home/ubuntu/memberCertification/build/reports/tests/test/index.html * Try: > Run with --scan to get full insights. Deprecated Gradle features were used in this build, making it incompatible with Gradle 9.0. You can use '--warning-mode all' to show the individual deprecation warnings and determine if they come from your own scripts or plugins. For more on this, please refer to https://docs.gradle.org/8.7/userguide/command_line_interface.html#sec:command_line_warnings in the Gradle documentation. BUILD FAILED in 14s 8 actionable tasks: 8 executed 구글에 검색해본 결과, java: error: invalid flag: --warning-mode=all을 하면 된다는 글을 보고 Preferences > Compiler > java Compiler에 --warning-mode all --stacktrace 입력을 하고 실행을 해봤습니다. java: error: invalid flag: --warning-mode=all가 발생하며 실행이 되지 않습니다. 어떻게 해야 에러를 고칠 수 있을까요 ?
- name: S3에 프로젝트 폴더 업로드하기 run : aws s3 cp --region 과정을 통해서 압축된 tar.gz 파일은 s3에 저장한다고 이해했는데 따로 압축해제하는 과정이 없어서 질문드립니다. run: aws s3 cp --region ... 다음 S3에 프로젝트 폴더 업로드 하는 과정에서 s3에서 해당 파일을 받고 난 후에 알아서 압축해제를 하는건가요??
실습에 문제 발생 시 최대한 캡쳐 화면을 꼭 올려 주세요. (원인 파악에 도움이 큽니다) 영상 내용 질문 시 해당 영상 제목과 내용이 있는 시간을 같이 올려주세요. (내용을 다시 들어보고 답변을 드리기 위해서 입니다) 긴 로그는 제 메일로 보내주세요. (k8s.1pro@gmail.com) 카페 [강의 자료실]에도 많은 질문과 답변들이 있어요! cafe: https://cafe.naver.com/kubeops 3단계에서 Rocky Linux Repo 세팅에서 안되서 문의드립니다.
카페에 쿠버네티스 설치과정을 마스터노드 1개만 할 경우 잘 작동합니다. 하지만 궁금증에 마스터1개 노드2개를 vm에 설치해서 연동? 시켜보고싶어서 하는 과정에서 모든 설치과정을 마스터와 노드 똑같이 실행하였습니다. 다만 마스터에서만 실행한 부분은 kubeadm init --pod-network-cidr=20.96.0.0/12 --apiserver-advertise-address 192.168.56.30 mkdir -p $HOME/.kube cp -i /etc/kubernetes/admin.conf $HOME/.kube/config chown $(id -u):$(id -g) $HOME/.kube/config kubectl create -f https://raw.githubusercontent.com/k8s-1pro/install/main/ground/k8s-1.27/calico-3.26.4/calico.yaml kubectl create -f https://raw.githubusercontent.com/k8s-1pro/install/main/ground/k8s-1.27/calico-3.26.4/calico-custom.yaml 이렇게 명령어만 마스터에서 실행하였습니다. kubeadm init을 통해 나온 kubeadm join을 각 노드에 실행하면 error execution phase preflight: [preflight] Some fatal errors occurred: [ERROR FileAvailable--etc-kubernetes-kubelet.conf]: /etc/kubernetes/kubelet.conf already exists [ERROR Port-10250]: Port 10250 is in use [ERROR FileAvailable--etc-kubernetes-pki-ca.crt]: /etc/kubernetes/pki/ca.crt already exists 이라는 오류가 발생하더라고요. https://dongle94.github.io/kubernetes/kubernetes-cluster-reset/#google_vignette 이렇게 해결해보았지만 똑같은 오류가 발생했습니다. 우분투 20.04 lts , 22.04 lts, rocky9 모두 실행해보았지만 같은 오류가 발생하였습니다. 도와주세여 ㅠ
저기 오류가 발생하여 무시하고 진행했을때 Running as SYSTEM Building in workspace /var/lib/jenkins/workspace/2121-source-build The recommended git tool is: NONE No credentials specified Cloning the remote Git repository Cloning repository https://github.com/k8s-1pro/kubernetes-anotherclass-api-tester.git > git init /var/lib/jenkins/workspace/2121-source-build # timeout=10 ERROR: Error cloning remote repo 'origin' hudson.plugins.git.GitException: Could not init /var/lib/jenkins/workspace/2121-source-build at org.jenkinsci.plugins.gitclient.CliGitAPIImpl$5.execute( CliGitAPIImpl.java:1073 ) at org.jenkinsci.plugins.gitclient.CliGitAPIImpl$2.execute( CliGitAPIImpl.java:819 ) at hudson.plugins.git.GitSCM.retrieveChanges( GitSCM.java:1222 ) at hudson.plugins.git.GitSCM.checkout( GitSCM.java:1305 ) at hudson.scm.SCM.checkout( SCM.java:540 ) at hudson.model.AbstractProject.checkout( AbstractProject.java:1245 ) at hudson.model.AbstractBuild$AbstractBuildExecution.defaultCheckout( AbstractBuild.java:649 ) at jenkins.scm.SCMCheckoutStrategy.checkout( SCMCheckoutStrategy.java:85 ) at hudson.model.AbstractBuild$ AbstractBuildExecution.run ( AbstractBuild.java:521 ) at hudson.model.Run .execute( Run.java:1900 ) at hudson.model.FreeStyleBuild.run ( FreeStyleBuild.java:44 ) at hudson.model.ResourceController.execute( ResourceController.java:101 ) at hudson.model.Executor.run ( Executor.java:442 ) Caused by: hudson.plugins.git.GitException: Error performing git command: git init /var/lib/jenkins/workspace/2121-source-build at org.jenkinsci.plugins.gitclient.CliGitAPIImpl.launchCommandIn( CliGitAPIImpl.java:2858 ) at org.jenkinsci.plugins.gitclient.CliGitAPIImpl.launchCommandIn( CliGitAPIImpl.java:2762 ) at org.jenkinsci.plugins.gitclient.CliGitAPIImpl.launchCommandIn( CliGitAPIImpl.java:2757 ) at org.jenkinsci.plugins.gitclient.CliGitAPIImpl.launchCommand( CliGitAPIImpl.java:2051 ) at org.jenkinsci.plugins.gitclient.CliGitAPIImpl$5.execute( CliGitAPIImpl.java:1071 ) ... 12 more Caused by: java.io .IOException: Cannot run program "git" (in directory "/var/lib/jenkins/workspace/2121-source-build"): error=2, No such file or directory at java.base/java.lang.ProcessBuilder.start( ProcessBuilder.java:1128 ) at java.base/java.lang.ProcessBuilder.start( ProcessBuilder.java:1071 ) at hudson.Proc$LocalProc.<init>( Proc.java:252 ) at hudson.Proc$LocalProc.<init>( Proc.java:221 ) at hudson.Launcher$LocalLauncher.launch( Launcher.java:994 ) at hudson.Launcher$ProcStarter.start( Launcher.java:506 ) at org.jenkinsci.plugins.gitclient.CliGitAPIImpl.launchCommandIn( CliGitAPIImpl.java:2835 ) ... 16 more Caused by: java.io .IOException: error=2, No such file or directory at java.base/java.lang.ProcessImpl.forkAndExec(Native Method) at java.base/java.lang.ProcessImpl.<init>( ProcessImpl.java:340 ) at java.base/java.lang.ProcessImpl.start( ProcessImpl.java:271 ) at java.base/java.lang.ProcessBuilder.start( ProcessBuilder.java:1107 ) ... 22 more ERROR: Error cloning remote repo 'origin' Finished: FAILURE 로그에서 이러한 오류를 발견했습니다. 사진과 같은 깃저장소의 오류때메 발생하는 거같습니다.
[ 무게감 있게 설치하는 방법 2/3 ] - k ubelet, kubeadm, kubectl 패키지 설치 과정 중 발생한 문제 아래 캡쳐본과 같이 "sudo yum install -y kubelet-1.27.1-0.x86_64 kubeadm-1.27.1-0.x86_64 kubectl-1.27.1-0.x86_64 --disableexcludes=kubernetes" 입력 시 다음과 같은 에러가 발생하는데 구글링을 해봐도 잘 이해가 되지 않습니다. 조언주시면 감사하겠습니다 !
scp root@192.168.56.30:/root/.kube/config ~/.kube 192.168.56.30 vm을 꺼놨어서 못 가져오는 거 같아서 192.168.56.30 vm을 동작시키려니 저런 에러가 발생합니다. 1.192.168.56.30 vm을 켠 상태로 위 명령어를 작성하는게 맞나요? (인강을 보니 이건 켠 상태로 하는게 맞네요) 2.오류를 어떻게 해결할 수 있을까요?
VM 을 전원 재기동 해서 쿠버네티스도 종료되어서 파드들이 다 죽는 것으로 생각했는데, 재기동 후 파드 조회를 해보니 하나씩 Running 상태로 되어가더라구요. 쿠버네티스 자체는 서버에서 데몬처럼 동작하고, 쿠버네티스들이 파드를 자동으로 Run 시켜주는 것으로 보이는데 해당 현상에 대한 해석이 맞는지 문의드립니다. 감사합니다.
echo '======== [4] OpenJDK 설치 ========' # yum list --showduplicates java-17-openjdk yum install -y java-17-openjdk echo '======== [5] Gradle 설치 ========' yum -y install wget unzip wget https://services.gradle.org/distributions/gradle-7.6.1-bin.zip -P ~/ unzip -d /opt/gradle ~/gradle-*.zip cat <<EOF |tee /etc/profile.d/gradle.sh export GRADLE_HOME=/opt/gradle/gradle-7.6.1 export PATH=/opt/gradle/gradle-7.6.1/bin:${PATH} EOF chmod +x /etc/profile.d/gradle.sh source /etc/profile.d/gradle.sh echo '======== [6] Git 설치 ========' yum install -y git-2.39.3-1.el8_8 echo '======== [7] Jenkins 설치 ========' wget -O /etc/yum.repos.d/jenkins.repo https://pkg.jenkins.io/redhat-stable/jenkins.repo rpm --import https://pkg.jenkins.io/redhat-stable/jenkins.io-2023.key yum install -y java-11-openjdk jenkins-2.414.2-1.1 systemctl enable jenkins systemctl start jenkins 위 설치 스크립트를 바탕으로 jenkins를 설치 후에, 플러그인을 설치하고 있었는데 위와 같이 몇몇 플러그인이 설치가 되지 않았습니다 ㅠ 제가 이 강의하면서 jenkins를 거의 처음 써봐서 이런 경우 어떻게 대처해야할지 잘 모르겠습니다...! 추상적으로 여쭤봐 죄송하지만, 혹시 어떤 대처를 하면 될지 알려주시면 감사드리겠습니다. 혹시 자바 설치 버젼도 필요하실까봐 올려드립니다 ls /usr/lib/jvm/ java-11-openjdk-11.0.18.0.9-0.3.ea.el8.x86_64 jre-11-openjdk-11.0.18.0.9-0.3.ea.el8.x86_64 java-17-openjdk-17.0.6.0.9-0.3.ea.el8.x86_64 jre-17 jre jre-17-openjdk jre-11 jre-17-openjdk-17.0.6.0.9-0.3.ea.el8.x86_64 jre-11-openjdk jre-openjdk ## java --version openjdk 17.0.6-ea 2023-01-17 LTS OpenJDK Runtime Environment (Red_Hat-17.0.6.0.9-0.3.ea.el8) (build 17.0.6-ea+9-LTS) OpenJDK 64-Bit Server VM (Red_Hat-17.0.6.0.9-0.3.ea.el8) (build 17.0.6-ea+9-LTS, mixed mode, sharing) 젠킨스 로그인 후 dependency 오류 내용 Some plugins could not be loaded due to unsatisfied dependencies. Fix these issues and restart Jenkins to re-enable these plugins. Dependency errors: Timestamper (1.26) Plugin is missing: antisamy-markup-formatter (159.v25b_c67cd35fb_) Pipeline: Declarative Extension Points API (2.2150.v4cfd8916915c) Plugin is missing: workflow-cps (3791.va_c0338ea_b_59c) Pipeline Graph Analysis Plugin (216.vfd8b_ece330ca_) Plugin is missing: workflow-cps (3659.v582dc37621d8) Pipeline (596.v8c21c963d92d) Plugin is missing: workflow-cps (2660.vb_c0412dc4e6d) Plugin is missing: pipeline-groovy-lib (593.va_a_fc25d520e9) Pipeline: GitHub Groovy Libraries (42.v0739460cda_c4) Plugin is missing: pipeline-groovy-lib (629.vb_5627b_ee2104) Checks API plugin (2.0.2) Plugin is missing: plugin-util-api (3.3.0) Pipeline: Multibranch (770.v1a_d0708dd1f6) Plugin is missing: workflow-cps (3691.v28b_14c465a_b_b_) Gradle Plugin (2.10) Plugin is missing: workflow-cps (2660.vb_c0412dc4e6d) Bootstrap 5 API Plugin (5.3.2-3) Plugin is missing: font-awesome-api (6.4.2-1) Folders Plugin (6.858.v898218f3609d) Plugin is missing: ionicons-api (56.v1b_1c8c49374e) Some of the above failures also result in additional indirectly dependent plugins not being able to load. Indirectly dependent plugins: JUnit Plugin (1265.v65b_14fa_f12f0) Failed to load: Bootstrap 5 API Plugin (bootstrap5-api 5.3.2-3) Pipeline (596.v8c21c963d92d) Failed to load: Pipeline: Multibranch (workflow-multibranch 770.v1a_d0708dd1f6) Matrix Project Plugin (822.824.v14451b_c0fd42) Failed to load: JUnit Plugin (junit 1265.v65b_14fa_f12f0) Pipeline: REST API Plugin (2.34) Failed to load: Pipeline Graph Analysis Plugin (pipeline-graph-analysis 216.vfd8b_ece330ca_) Workspace Cleanup Plugin (0.45) Failed to load: Matrix Project Plugin (matrix-project 822.824.v14451b_c0fd42)
일프로님 바쁜 와중에 질문드립니다. 2-1. App 생성 하기 - [+ NEW APP] 내용 입력 후 결과 값이 아래와 같이 나옵니다. REPO 관련 문제 인것 같은데요. 제 설정에 문제가 있을까요 ? ~~ Unable to create application: application spec for api is invalid: InvalidSpecError: repository not accessible: repositories not accessible: &Repository{Repo: " https://github.com/k8s-1pro/kubernetes-anotherclass-sprint2.git ", Type: "", Name: "", Project: ""}: repo client error while testing repository: rpc error: code = Unknown desc = error testing repository connectivity: Get " https://github.com/k8s-1pro/kubernetes-anotherclass-sprint2.git/info/refs?service=git-upload-pack ": dial tcp: lookup github.com on 10.96.0.10:53: server misbehaving ~~~ ---- ~~~ argocd@argo-cd-argocd-server-b7cd88d6b-n5dq6:~$ git clone https://github.com/k8s-1pro/kubernetes-anotherclass-sprint2.git Cloning into 'kubernetes-anotherclass-sprint2'... fatal: unable to access ' https://github.com/k8s-1pro/kubernetes-anotherclass-sprint2.git/ ': Could not resolve host: github.com ~~~ argocd 서버에서 git clone 시 도메인 관련 문제 발생하는 부분도 확인했습니다. kube dns 에 설정이 필요할까요 ? cafe: https://cafe.naver.com/kubeops
쿠버네티스 공식 문서의 local 문서에 다음과 같이 명시되어 있습니다. "쿠버네티스 스케줄러는 퍼시스턴트 볼륨 nodeaffinity를 사용하여 파드를 올바른 노드로 스케줄한다." 이 내용을 보고 한가지 의문점이 생기드라구요. aws 같은 퍼블릭 클라우드에서는 마스터 노드를 자동으로 컨트롤 해주는데, 그럼 클라우드 환경에서 nodeaffinity는 필요없는거 아닌가라는 의문점이 들었습니다. 클라우드 환경에서는 스케줄링도 알아서 해주는 것으로 아는데 nodeaffinity가 어떻게 동작하나요? 실습에 문제 발생 시 최대한 캡쳐 화면을 꼭 올려 주세요. (원인 파악에 도움이 큽니다) 영상 내용 질문 시 해당 영상 제목과 내용이 있는 시간을 같이 올려주세요. (내용을 다시 들어보고 답변을 드리기 위해서 입니다) 긴 로그는 제 메일로 보내주세요. (k8s.1pro@gmail.com) 카페 [강의 자료실]에도 많은 질문과 답변들이 있어요! cafe: https://cafe.naver.com/kubeops
ENV java_ home, ENV volume_path 등을 언급하셧는데 이 환경 변수들은 VM에서 사용하는 환경변수인건가요? 아님 도커에서 사용하는 환경변수인건가요? 항상 좋은 강의 감사합니다. 환경변수에 대해서는 실제 CI-CD 실습을 안하니 이해가 잘 안돼는거 같습니다. ㅠㅠ 빨리 다음 챕터로 넘어가서 한 번 실습을 해봐야겠네요 실습에 문제 발생 시 최대한 캡쳐 화면을 꼭 올려 주세요. (원인 파악에 도움이 큽니다) 영상 내용 질문 시 해당 영상 제목과 내용이 있는 시간을 같이 올려주세요. (내용을 다시 들어보고 답변을 드리기 위해서 입니다) 긴 로그는 제 메일로 보내주세요. (k8s.1pro@gmail.com) 카페 [강의 자료실]에도 많은 질문과 답변들이 있어요! cafe: https://cafe.naver.com/kubeops