빌드 오류 도와주세요 ㅜㅜ

미해결질문
lyj03152003 프로필

빌드를 하니 오류가 

FAILURE: Build failed with an exception.

* Where:

Build file 'C:\Users\YONGJAE\AndroidStudioProjects\instargram_clon\android\app\build.gradle' line: 5

* What went wrong:

A problem occurred evaluating project ':app'.

> Could not get unknown property 'localProperties' for project ':app' of type org.gradle.api.Project.

* Try:

Run with --stacktrace option to get the stack trace. Run with --info or --debug option to get more log output. Run with --scan to get full insights.

* Get more help at https://help.gradle.org

BUILD FAILED in 33s

Exception: Gradle task assembleDebug failed with exit code 1

알려주시면 감사하겠습니다.

지식공유자 되기
많은 사람들에게 배움의 기회를 주고,
경제적 보상을 받아보세요.
지식공유참여
기업 교육을 위한 인프런
“인프런 비즈니스” 를 통해 모든 팀원이 인프런의 강의들을
자유롭게 학습하는 환경을 제공하세요.
인프런 비즈니스